program: Gaussian 09
title: 000078468
version: EM64L-G09RevD.01
frameworkgroup: C1[X(C8H4O4)]
method: RPBEPBE
basis: SDD
operation: Freq
keyword: #p
keyword: freq=noraman
keyword: PBEPBE/SDD
title: #p freq=noraman PBEPBE/SDD
converged: NO YES NO NO
title: Mulliken charges:
elementType: O O O O C C C C C C C C H H H H
charge: -0.128275 -0.128274 -0.197854 -0.197853 0.145731 0.145730 -0.332601 -0.332601 0.181603 0.181603 -0.202356 -0.202355 0.282539 0.282539 0.251213 0.251212
chargesum: 0.00000
title: Mulliken charges with hydrogens summed into heavy atoms:
elementType: O O O O C C C C C C C C
charge: -0.128275 -0.128274 -0.197854 -0.197853 0.145731 0.145730 -0.050062 -0.050062 0.181603 0.181603 0.048857 0.048857
polarizability: 1.24383217e+02 -6.86157511e-06 1.35884159e+02 3.15966552e-07 4.59946635e-02 3.75427274e+01
1716.lowfreq: -10.8654 -10.3149 -0.0011 -0.0010 -0.0007 7.5165 84.0380 105.0022 185.4092
frequency: 84.0380 104.9906 185.4011 191.6410 243.2164 344.1968 411.0202 411.9418 424.4127 435.7069 497.1697 550.4218 636.6573 653.9262 662.5308 663.6146 710.0500 760.2762 779.8500 796.4682 918.2126 984.5364 996.3778 999.5146 1017.9371 1056.7064 1096.1273 1180.2830 1220.5187 1246.7993 1277.2710 1400.8378 1441.6966 1473.5863 1581.6338 1603.7457 1628.7566 1646.7944 3147.2065 3158.0718 3168.3731 3179.6044
redmass: 14.1982 5.3124 11.8838 6.1078 6.5711 11.8403 7.8973 3.7572 14.4422 4.9393 10.1398 10.9745 4.8986 8.1761 4.4908 9.0433 10.4102 5.2352 7.4488 1.3838 1.3685 9.7284 1.3845 6.5667 1.3584 2.1820 2.1831 1.0651 2.3773 4.0934 1.6330 10.6398 2.3544 2.5625 7.5306 6.4740 11.8946 12.2882 1.0869 1.0904 1.0955 1.1010
irintensity: 1.2415 0.0000 0.0000 1.3429 1.5094 13.9065 1.1397 0.2220 1.9668 0.0005 0.0011 0.0543 0.0016 5.0336 63.1496 4.2637 0.6519 0.0007 2.6894 54.4985 0.0001 77.4519 3.2861 64.1440 0.0015 22.5650 19.4925 3.1831 9.4262 200.2785 5.9042 6.7272 12.3053 2.3225 0.4016 70.7313 239.0510 104.4431 2.5901 2.0128 0.4295 12.2507
temp: 298.150 k
press: 1.00000 atm
elementType: 8 8 8 8 6 6 6 6 6 6 6 6 1 1 1 1
symmnumber: 1
zpe: 268993.0 jmol-1
zpe.correction: 0.102454 hartree
zpe.thermalcorrener: 0.111612 hartree
zpe.thermalcorrenthalpy: 0.112556 hartree
zpe.thermalcorrgfe: 0.067748 hartree
zpe.sumelectzpe: -607.250572 hartree
zpe.sumelectthermal: -607.241415 hartree
zpe.sumelectthermalent: -607.240470 hartree
zpe.sumelectthermalfe: -607.285279 hartree
dipole: -6.7875 0.0000 0.0000
dipole: 6.7875
quadrupole: -64.5741 -77.7935 -67.6817
quadrupole: 0.0000 0.0000 0.0490
quadrupole: 5.4423 -7.7770 2.3347 0.0000 0.0000 0.0490
hfenergy: -607.3530262 hartree
pointgroup: C01 [X(C8H4O4)]
dipole: -2.6703959 0.0002538 -0.0000014 debye
dipolederiv: -0.4442793 0.3817296 -0.0039263 -0.1404638 -0.1953344 -0.0002809 0.0022399 -0.0006136 -0.1424121 -0.4443234 -0.3816853 0.0039249 0.1405116 -0.1953045 -0.0002782 -0.0022429 -0.0006251 -0.1424109 -0.5441488 0.1251879 -0.0010408 -0.203357 -1.0332136 0.0047007 0.0014975 0.0044473 -0.2985068 -0.5441322 -0.1252807 0.0010417 0.203264 -1.0332317 0.0046898 -0.0014981 0.0044393 -0.2985066 -0.340095 -0.1631168 0.0005813 -0.4067747 -0.1230543 0.0009907 0.0014779 0.0006375 0.0273231 -0.3399746 0.1631577 -0.0005818 0.4068153 -0.1231613 0.0009891 -0.001477 0.0006343 0.0273237 -0.1902364 0.1268485 -0.0006021 -0.0626274 0.105643 -0.0005247 0.0004346 -0.0007798 -0.0941692 -0.1902565 -0.1267907 0.0006019 0.0626858 0.1056552 -0.0005253 -0.000431 -0.0007808 -0.09417 1.2527883 -0.3509983 0.0027213 0.3365105 1.2026109 -0.005478 -0.0030551 -0.0045331 0.3065848 1.2527822 0.3509921 -0.0027204 -0.3365183 1.202616 -0.0054609 0.0030553 -0.004511 0.3065846 0.1841414 -0.1485255 0.000279 -0.0603787 -0.0321277 -0.0000946 -0.0003685 -0.0000922 -0.1183299 0.1841832 0.1484831 -0.000279 0.0603349 -0.0321643 -0.0000949 0.0003676 -0.000092 -0.1183292 0.1175329 -0.050065 0.000262 0.0142115 0.0157626 0.0004444 0.0001138 0.0007414 0.160451 0.1175399 0.0500452 -0.0002618 -0.0142313 0.015756 0.0004446 -0.0001142 0.0007406 0.1604511 -0.0357469 0.0687013 -0.0000858 0.0753955 0.0597607 0.000239 -0.0001805 0.0001933 0.1590584 -0.0357749 -0.0686831 0.000086 -0.0753778 0.0597876 0.0002391 0.0001808 0.0001941 0.1590581 unknown
polarizability: 124.3832175|0.0011274|135.8813294|-0.0000038|-0.5295134|37.5455571 unknown
InChI: InChI=1S/C8H4O4/c9-7-5-3-1-2-4-6(5)8(10)12-11-7/h1-4H
charge 0 multiplicity 1
16 atoms
O  2.257117 0.795928 -0.007545
O  2.256968 -0.796381 0.007454
O  1.137695 2.735535 -0.018106
O  1.137171 -2.735774 0.017976
C  -0.234499 0.711517 -0.002773
C  -0.234635 -0.711493 0.002658
C  -1.461595 1.418234 -0.004701
C  -1.461865 -1.417974 0.004589
C  1.023622 1.490085 -0.009323
C  1.023341 -1.490303 0.009201
C  -2.679518 0.709067 -0.001969
C  -2.679653 -0.708572 0.001858
H  -1.437935 2.512506 -0.008789
H  -1.438416 -2.512251 0.008676
H  -3.62803 1.255465 -0.00294
H  -3.628269 -1.254791 0.00283
