program: Gaussian 09
title: 000078473
version: EM64L-G09RevD.01
frameworkgroup: C1[X(C9H19N)]
method: RPBEPBE
basis: SDD
operation: Freq
keyword: #pfreq=noraman
keyword: PBEPBE/SDD
title: #p freq=noraman PBEPBE/SDD
converged: YES YES NO NO
title: Mulliken charges:
elementType: N C C C C C C C C C H H H H H H H H H H H H H H H H H H H
charge: -0.578806 0.030902 -0.445228 -0.422161 -0.382416 -0.431658 -0.421981 -0.386292 -0.365086 -0.476089 0.213982 0.187384 0.210312 0.199409 0.186038 0.188826 0.194682 0.193347 0.202634 0.193266 0.196975 0.198864 0.195555 0.192529 0.189995 0.191428 0.208361 0.266312 0.268917
chargesum: 0.00000
title: Mulliken charges with hydrogens summed into heavy atoms:
elementType: N C C C C C C C C C
charge: -0.043577 0.244885 -0.047532 -0.036714 0.001092 -0.035678 -0.031741 0.008127 0.017438 -0.076300
polarizability: 1.13183439e+02 -5.87883691e-01 1.01831729e+02 -4.15964428e-01 5.76649373e-01 8.60295922e+01
1716.lowfreq: -18.4491 -0.0006 -0.0003 -0.0002 10.4273 16.3303 63.2303 97.7549 163.6813
frequency: 63.0103 97.7295 163.6573 185.4051 215.7356 222.9516 244.7003 275.3665 317.3061 342.2751 389.5082 417.3035 457.3313 477.2426 580.8433 617.9719 688.4690 752.7039 763.1330 796.7568 843.9203 865.7511 879.2302 891.5296 971.9175 979.9139 994.1085 1004.8375 1049.5420 1088.8267 1092.7889 1108.6631 1116.1159 1124.9837 1135.1208 1171.7695 1199.4782 1216.5145 1236.7507 1258.0547 1262.7457 1267.1033 1291.7021 1305.3664 1328.4613 1331.6986 1340.1158 1345.1114 1353.4059 1357.3600 1367.8903 1368.8762 1382.4111 1458.6835 1461.4471 1466.3876 1470.0194 1471.2030 1476.6949 1487.7595 1497.2233 1639.5149 2861.1477 2947.8499 2951.4101 2959.7054 2960.6060 2963.7965 2970.4119 2971.3243 2979.7216 3001.0484 3003.6714 3011.8738 3015.1322 3018.1362 3021.0786 3027.2370 3036.6673 3458.5593 3582.0137
redmass: 2.8534 2.3726 2.4431 2.3365 2.2670 1.1424 2.7419 2.1354 2.4526 1.9949 2.2292 2.2517 1.9845 1.7301 2.2280 1.3262 2.1158 1.5316 2.0001 2.4807 1.5337 1.7233 1.6313 1.9341 1.7643 2.1270 1.9756 1.8653 2.1457 2.7749 1.5969 1.8263 1.4416 2.4119 1.7250 1.3228 1.3322 1.3651 1.2727 1.2739 1.1471 1.3313 1.1088 1.1836 1.3793 1.3130 1.4386 1.4055 1.4201 1.3734 1.3609 1.4220 1.4092 1.0798 1.0903 1.0763 1.0888 1.0840 1.0835 1.0784 1.0810 1.0928 1.0704 1.0605 1.0658 1.0674 1.0627 1.0640 1.0637 1.0702 1.0671 1.0979 1.0962 1.0918 1.0986 1.0989 1.0987 1.0984 1.0986 1.0449 1.0971
irintensity: 0.8233 5.4435 0.9647 0.2503 6.2409 59.3543 0.2397 1.2056 7.0104 1.5011 2.2782 0.6727 4.0715 0.9611 15.8283 187.2397 4.4880 10.5169 2.0703 3.3024 4.2260 0.9645 3.8244 2.0861 1.4300 1.4694 0.9913 2.4819 8.0971 11.6541 3.3932 2.8273 2.4303 2.0139 3.7816 0.2107 1.0702 0.7826 1.8599 0.7490 0.3246 0.0684 0.3860 2.6637 2.1323 0.7156 0.1244 0.0268 0.6502 0.5725 0.5663 1.6379 6.5882 0.9642 12.1207 3.2321 6.9908 14.5810 3.8126 8.5668 27.9432 47.9428 94.9325 31.3271 4.1586 40.3559 20.5419 30.5937 25.4445 57.6600 31.9129 27.8763 47.5380 58.6471 7.1126 137.2221 92.3405 34.6766 132.2605 1.3896 0.1096
temp: 298.150 k
press: 1.00000 atm
elementType: 7 6 6 6 6 6 6 6 6 6 1 1 1 1 1 1 1 1 1 1 1 1 1 1 1 1 1 1 1
symmnumber: 1
zpe: 704431.7 jmol-1
zpe.correction: 0.268304 hartree
zpe.thermalcorrener: 0.279303 hartree
zpe.thermalcorrenthalpy: 0.280247 hartree
zpe.thermalcorrgfe: 0.232480 hartree
zpe.sumelectzpe: -408.244522 hartree
zpe.sumelectthermal: -408.233523 hartree
zpe.sumelectthermalent: -408.232579 hartree
zpe.sumelectthermalfe: -408.280346 hartree
dipole: 0.0940 0.3724 -1.0825
dipole: 1.1486
quadrupole: -64.0191 -64.4101 -63.9692
quadrupole: -2.0938 4.7995 1.5909
quadrupole: 0.1137 -0.2773 0.1636 -2.0938 4.7995 1.5909
hfenergy: -408.5128255 hartree
pointgroup: C01 [X(C9H19N1)]
dipole: -0.0501923 -0.1438245 -0.4254627 debye
polarizability: 113.1750903|-0.6905125|101.8474507|-0.3618261|-0.470662|86.0222197 unknown
InChI: InChI=1S/C9H19N/c10-8-9-6-4-2-1-3-5-7-9/h9H,1-8,10H2
charge 0 multiplicity 1
29 atoms
N  3.372359 0.468785 -0.594562
C  1.180919 0.051348 0.554985
C  0.490818 1.25178 -0.160782
C  0.23116 -1.065943 1.067472
C  -0.824537 1.778065 0.48614
C  -0.548931 -1.916916 0.033266
C  -2.14294 1.312983 -0.189572
C  -1.569409 -1.166371 -0.864926
C  -2.520551 -0.190791 -0.111512
C  2.315796 -0.532743 -0.32473
H  1.680777 0.467095 1.456038
H  0.292678 0.99394 -1.221292
H  1.226676 2.08044 -0.179244
H  -0.494434 -0.615288 1.772499
H  0.841594 -1.762539 1.680609
H  -0.819534 2.885994 0.445099
H  -0.845526 1.520823 1.564432
H  -1.103003 -2.691898 0.603353
H  0.161141 -2.468793 -0.61485
H  -2.103804 1.604731 -1.260748
H  -2.976382 1.895518 0.256037
H  -2.174677 -1.93441 -1.387166
H  -1.038424 -0.612608 -1.662621
H  -2.607146 -0.49936 0.950592
H  -3.540248 -0.288949 -0.535571
H  1.865931 -0.96076 -1.25525
H  2.787066 -1.374162 0.219754
H  3.064576 1.246844 -1.18615
H  4.252055 0.066983 -0.932599
