program: Gaussian 09
title: 000078472
version: EM64L-G09RevD.01
frameworkgroup: C1[X(C10H18N2)]
method: RPBEPBE
basis: SDD
operation: Freq
keyword: #pfreq=noraman
keyword: PBEPBE/SDD
title: #p freq=noraman PBEPBE/SDD
converged: NO YES NO NO
title: Mulliken charges:
elementType: N N C C C C C C C C C C H H H H H H H H H H H H H H H H H H
charge: -0.084328 -0.024326 -0.357434 -0.363252 -0.395299 -0.390939 -0.398865 -0.344713 -0.412849 -0.348341 -0.425553 -0.154809 0.171287 0.207162 0.212355 0.168199 0.192825 0.204854 0.206120 0.192844 0.215847 0.189333 0.191261 0.201007 0.202723 0.199463 0.208549 0.252379 0.243392 0.241109
chargesum: 0.00000
title: Mulliken charges with hydrogens summed into heavy atoms:
elementType: N N C C C C C C C C C C
charge: -0.084328 -0.024326 0.021015 0.017303 0.002380 0.008025 0.006315 0.047555 -0.010663 0.112586 0.058948 -0.154809
polarizability: 1.32189439e+02 -3.46193148e+00 1.11374563e+02 -1.79469750e+00 3.53491236e+00 1.02705909e+02
1716.lowfreq: -3.3526 0.0005 0.0008 0.0010 10.1393 21.8593 25.9237 37.2258 53.6154
frequency: 25.7168 36.9340 53.1514 94.1279 110.4086 167.5723 220.8235 248.8768 276.1060 288.0565 327.7108 372.1534 386.6767 415.8393 449.0393 497.9236 529.6959 548.1126 717.8118 746.9761 803.4495 824.9566 851.8225 855.5413 881.8628 904.7001 926.3953 957.6778 964.5445 1017.7155 1037.5088 1053.4407 1054.9893 1083.6974 1101.3150 1116.1730 1120.8159 1147.4479 1151.2813 1161.6124 1212.0715 1242.1248 1258.7423 1264.2522 1267.5095 1281.6087 1283.9411 1296.1090 1321.2199 1328.2560 1339.8385 1340.7298 1348.9689 1358.2181 1368.4525 1388.6346 1447.2618 1451.3217 1458.0264 1459.7041 1463.8630 1470.4980 1471.7498 1481.7213 1484.6964 2196.5327 2814.5099 2823.4439 2847.1219 2968.2131 2971.5140 2982.2319 2985.2417 2985.5383 2999.8343 3003.2725 3020.8207 3025.6000 3032.6347 3034.0764 3037.5380 3045.6471 3055.2027 3076.3236
redmass: 3.0568 4.8565 2.3352 2.8514 4.3717 2.7947 2.2195 2.0373 3.6667 2.6324 2.0364 3.4766 1.8148 3.0803 2.8852 4.2323 2.1276 2.3395 1.8632 1.3938 1.4719 1.7223 1.9066 1.7068 1.7930 2.8537 3.1104 1.3018 2.2817 2.3156 3.1647 1.8470 1.9437 2.3402 1.5211 2.4150 2.2929 1.3697 1.3585 1.8741 1.3877 1.4836 1.2722 1.1872 1.2786 1.1587 1.2781 1.3370 1.3473 1.2827 1.3955 1.4722 1.5012 1.5053 1.3997 1.4094 1.0835 1.0903 1.0842 1.0874 1.0837 1.0851 1.0854 1.0958 1.0918 12.4324 1.0716 1.0703 1.0699 1.0625 1.0601 1.0586 1.0602 1.0625 1.0663 1.0882 1.0901 1.0915 1.0920 1.0996 1.0914 1.1034 1.1037 1.1030
irintensity: 1.7335 0.6721 3.5700 1.3702 2.5216 4.8295 0.6542 0.3280 1.0785 3.4732 1.0882 0.4765 2.7659 1.1038 0.5633 4.7315 3.2463 1.2651 12.2329 5.6072 0.0638 0.4377 4.6402 2.1153 1.7893 5.0987 1.1661 2.8774 15.0119 7.3357 4.3857 5.3358 11.8662 0.3126 2.0742 27.1161 3.4642 4.7034 6.0655 22.3414 19.7489 11.0238 5.2779 3.0827 7.3817 0.5419 7.0008 9.5916 1.2111 8.4030 0.9318 7.8461 1.4243 7.9673 2.4928 1.5657 6.0312 8.0957 5.3630 13.8238 0.3703 13.5597 7.2672 7.0385 18.5203 15.6637 47.0236 87.0037 203.1813 38.0578 31.7077 8.9648 37.8258 24.6791 27.0183 3.3989 13.9322 106.4575 63.9133 11.4574 27.2042 18.9220 99.3925 40.9572
temp: 298.150 k
press: 1.00000 atm
elementType: 7 7 6 6 6 6 6 6 6 6 6 6 1 1 1 1 1 1 1 1 1 1 1 1 1 1 1 1 1 1
symmnumber: 1
zpe: 696977.1 jmol-1
zpe.correction: 0.265465 hartree
zpe.thermalcorrener: 0.278314 hartree
zpe.thermalcorrenthalpy: 0.279258 hartree
zpe.thermalcorrgfe: 0.224483 hartree
zpe.sumelectzpe: -500.376733 hartree
zpe.sumelectthermal: -500.363883 hartree
zpe.sumelectthermalent: -500.362939 hartree
zpe.sumelectthermalfe: -500.417715 hartree
dipole: -3.5632 3.5009 1.4846
dipole: 5.2113
quadrupole: -93.0001 -78.8788 -72.7491
quadrupole: 15.3540 6.5606 -2.6442
quadrupole: -11.4575 2.6639 8.7936 15.3540 6.5606 -2.6442
hfenergy: -500.6421976 hartree
pointgroup: C01 [X(C10H18N2)]
dipole: -1.4235768 -1.1792451 -0.8868064 debye
polarizability: 132.1844079|1.8861393|109.5263763|3.6517057|4.8532003|104.5591267 unknown
InChI: InChI=1S/C10H18N2/c11-7-3-1-4-8-12-9-5-2-6-10-12/h1-6,8-10H2
charge 0 multiplicity 1
30 atoms
N  -1.218192 -0.520045 0.053677
N  4.707751 1.385358 1.033145
C  -1.701754 -0.057403 -1.27261
C  -2.342411 -0.637004 1.01961
C  -2.401389 1.313413 -1.165798
C  -3.05959 0.715777 1.204374
C  -3.566827 1.25659 -0.151848
C  -0.419511 -1.768142 -0.030852
C  0.995955 -1.549063 -0.613371
C  1.833199 -0.569315 0.235049
C  3.215051 -0.283503 -0.415911
C  4.046412 0.63827 0.377895
H  -2.417311 -0.802697 -1.715011
H  -0.841524 0.016467 -1.962333
H  -1.933507 -0.984052 1.987203
H  -3.09019 -1.402996 0.678627
H  -2.766717 1.617746 -2.165647
H  -1.660295 2.066669 -0.835137
H  -2.346357 1.437464 1.647414
H  -3.899071 0.592393 1.915493
H  -4.0218 2.257097 -0.025635
H  -4.360801 0.585885 -0.541454
H  -0.946156 -2.554403 -0.632147
H  -0.317661 -2.168845 0.996983
H  1.502713 -2.534251 -0.671023
H  0.926168 -1.175271 -1.65496
H  1.985525 -0.987094 1.248953
H  1.267596 0.371046 0.359193
H  3.072013 0.152986 -1.42402
H  3.77548 -1.229176 -0.554759
