program: Gaussian 09
title: 000081719
version: EM64L-G09RevD.01
frameworkgroup: C1[X(C28H24O7)]
method: RPBEPBE
basis: SDD
operation: Freq
keyword: #pfreq=noraman
keyword: PBEPBE/SDD
title: #p freq=noraman PBEPBE/SDD
converged: YES YES NO NO
title: Mulliken charges:
elementType: O O O O O O O C C C C C C C C C C C C C C C C C C C C C C C C C C C C H H H H H H H H H H H H H H H H H H H H H H H H
charge: -0.223597 -0.267113 -0.207185 -0.284488 -0.284538 -0.213542 -0.213571 -0.085571 0.296954 0.354171 0.354138 0.085101 0.151935 0.151904 0.097936 -0.394368 -0.337140 -0.337185 -0.375258 -0.577199 -0.577126 -0.358405 -0.358351 -0.213363 0.385908 0.385972 -0.221574 0.221073 0.221142 -0.488588 -0.488631 -0.339498 -0.339685 -0.682773 -0.682758 0.258074 0.250325 0.250328 0.271795 0.290355 0.290359 0.305299 0.305189 0.236065 0.238309 0.247826 0.244783 0.244679 0.247904 0.219255 0.218178 0.219882 0.217695 0.225489 0.210144 0.208843 0.225491 0.208802 0.210208
chargesum: 0.00000
title: Mulliken charges with hydrogens summed into heavy atoms:
elementType: O O O O O O O C C C C C C C C C C C C C C C C C C C C C C C C C C C C
charge: -0.223597 -0.267113 -0.207185 -0.284488 -0.284538 -0.213542 -0.213571 -0.085571 0.296954 0.354171 0.354138 0.085101 0.151935 0.151904 0.097936 -0.136294 -0.086816 -0.086857 -0.103463 -0.286844 -0.286768 -0.053107 -0.053162 0.022702 0.385908 0.385972 0.016734 0.221073 0.221142 0.004021 0.003952 0.097935 0.097892 -0.038297 -0.038257
polarizability: 4.63230900e+02 -1.88167789e-02 3.72757699e+02 -9.04735592e-02 -2.48272005e+00 2.21144130e+02
1716.lowfreq: -4.3301 -0.0016 0.0005 0.0008 1.7502 4.3245 13.9304 17.7601 20.7629
frequency: 13.9167 17.7552 20.7571 28.6103 28.7799 34.0852 36.6642 39.5447 45.8557 54.7945 69.8988 75.9330 91.7559 108.8495 118.7137 122.9283 131.0955 163.4085 183.5398 184.6296 200.4152 211.9616 223.2619 231.1511 231.6142 247.8733 259.9348 271.5969 278.5654 310.6806 315.1179 333.0606 362.9413 363.4041 382.2112 386.0893 417.3156 435.7381 456.3256 463.5997 473.4413 501.7797 502.5297 531.3340 531.6550 555.3653 574.1890 599.5670 604.0075 607.8372 616.7950 629.6422 648.3202 665.1009 688.0787 689.7207 708.7658 721.0293 724.3212 728.4460 734.2209 735.7140 735.9775 758.4313 774.2008 786.7575 790.8150 831.2813 843.8572 856.2509 856.5921 867.5090 867.5676 885.4924 886.7531 887.9864 896.1007 910.2073 927.0367 932.8370 952.8768 971.0838 979.1263 979.5519 981.0933 997.8945 1003.7737 1027.8606 1050.9362 1052.1801 1075.7269 1079.3455 1086.3520 1099.2229 1099.7164 1101.0102 1103.5133 1125.4222 1126.4214 1146.2741 1151.0192 1171.7793 1174.1921 1199.2102 1217.6423 1218.4336 1218.4841 1220.3590 1251.4241 1254.3653 1269.0618 1278.4994 1283.6361 1284.8079 1285.1168 1289.3120 1289.9942 1360.3898 1360.4856 1383.0758 1391.0780 1398.0354 1398.1195 1400.9223 1416.3491 1433.7137 1436.0714 1437.3119 1449.8585 1461.2583 1473.0660 1473.1044 1480.2971 1481.0873 1481.1289 1485.0373 1485.6062 1485.8183 1564.3832 1590.2603 1605.7050 1615.8703 1618.6213 1639.5814 1659.5241 1660.2991 1687.5855 2976.1688 2976.2512 2987.2872 2987.4733 3005.1437 3005.2089 3030.6475 3031.2755 3052.7531 3053.0007 3079.2278 3079.4187 3079.6799 3079.7367 3135.7240 3147.3262 3147.4344 3147.6889 3158.6274 3171.7571 3186.7278 3187.0804 3219.2013 3219.2657
redmass: 3.2088 2.4676 6.7522 6.7257 2.8326 2.6431 3.8945 5.9759 4.4374 4.9932 4.5338 4.5539 3.2047 3.3220 5.3741 3.9566 4.9760 6.3381 5.6016 5.9717 6.1025 7.3676 5.6991 1.0839 1.0840 6.4408 5.8837 7.2237 7.1852 7.8132 6.3099 4.5712 5.9676 3.7344 4.3344 4.9382 3.3474 6.6458 4.7193 3.3160 3.7906 8.4482 4.7156 2.7564 2.7634 9.1187 5.7810 8.7133 7.7731 7.5289 4.9929 7.1984 4.5480 4.8686 6.7470 6.6852 6.3171 5.2116 3.6838 7.9209 4.4311 1.1957 1.2794 3.0167 7.9688 1.6626 3.4072 4.7488 1.3920 1.9500 4.4287 1.3247 1.3250 1.5631 1.5649 1.5671 2.2519 2.1946 3.8356 5.8818 3.6147 1.4339 1.3366 1.3457 2.9779 5.5118 1.3352 2.4622 2.3817 2.3573 2.8636 4.2843 3.2632 1.6634 1.5527 1.9651 2.1697 2.3159 2.2231 2.1248 1.8846 1.1852 1.4293 3.1213 1.8243 1.3361 1.3358 5.2686 3.3817 3.0662 1.4770 1.5677 2.0708 1.1486 1.1133 1.4509 1.4269 1.6745 1.6796 9.4582 10.5633 1.2146 1.2147 8.8486 4.3960 2.1148 1.0892 1.4613 2.4775 2.6156 1.0578 1.0553 2.8263 1.0428 1.0437 1.9195 1.0823 1.3216 9.1873 9.4461 7.6451 7.3262 7.2348 7.6024 10.2797 10.3045 12.9850 1.0363 1.0363 1.0616 1.0614 1.0608 1.0608 1.0977 1.0975 1.1006 1.1006 1.1019 1.1021 1.0991 1.0989 1.0863 1.0910 1.0902 1.0911 1.0955 1.1004 1.0928 1.0930 1.0943 1.0943
irintensity: 0.2163 0.1754 0.7039 0.6535 0.8865 0.8651 2.6219 0.0142 1.7193 1.8400 1.0095 0.3277 0.1990 2.6378 0.3032 0.0017 0.8874 0.0711 2.7800 1.5823 1.3918 6.7736 5.0042 0.0210 0.0246 0.0739 0.7076 14.1985 1.0277 7.0372 15.7508 0.2814 7.6712 0.2328 0.0324 5.3116 0.6619 0.1785 4.4448 9.1787 0.3102 17.9484 0.0351 0.2095 0.3434 3.1116 5.2781 2.3655 0.0569 0.8996 1.1488 10.6673 11.4765 19.9011 7.3489 0.1670 6.7173 43.2694 0.4220 0.4568 14.8963 19.5230 8.3545 35.3942 38.0787 38.4815 152.0821 5.2088 0.0549 32.3215 20.4435 0.6237 0.8708 0.1880 92.4184 1.9217 0.4142 63.4788 5.3802 3.1242 3.8565 0.9763 5.5878 14.3442 274.1787 159.1538 0.0216 70.5699 347.5678 10.1960 3.8795 1011.7467 77.4626 0.9920 0.8898 17.2514 689.5213 17.5583 113.3755 236.3389 9.7093 6.0150 35.4448 66.0693 110.8941 0.1287 0.1448 30.0646 6.4951 80.4024 8.7806 0.9146 11.3209 19.1889 9.3126 119.6283 42.7834 47.0694 13.5796 193.0079 0.0653 7.6248 8.3092 3.0438 110.2482 114.4817 0.7766 0.9360 14.1673 2.7421 10.1414 8.4234 246.8763 14.3659 13.1221 32.5250 19.8752 2.3063 2.4551 52.8625 5.0548 11.3846 330.2369 9.0693 190.4046 146.0750 395.9778 35.6660 43.2447 10.0531 9.1445 19.4852 21.7117 1.4364 1.4876 0.0283 0.0500 65.7134 78.6076 58.9752 38.4429 0.7565 0.5493 5.0938 11.1614 8.5096 21.2463 0.1282 0.3912 11.1448 3.5453
temp: 298.150 k
press: 1.00000 atm
elementType: 8 8 8 8 8 8 8 6 6 6 6 6 6 6 6 6 6 6 6 6 6 6 6 6 6 6 6 6 6 6 6 6 6 6 6 1 1 1 1 1 1 1 1 1 1 1 1 1 1 1 1 1 1 1 1 1 1 1 1
symmnumber: 1
zpe: 1184759.7 jmol-1
zpe.correction: 0.451251 hartree
zpe.thermalcorrener: 0.483419 hartree
zpe.thermalcorrenthalpy: 0.484363 hartree
zpe.thermalcorrgfe: 0.382028 hartree
zpe.sumelectzpe: -1605.502895 hartree
zpe.sumelectthermal: -1605.470727 hartree
zpe.sumelectthermalent: -1605.469782 hartree
zpe.sumelectthermalfe: -1605.572118 hartree
dipole: 0.0019 -3.5739 -5.5031
dipole: 6.5617
quadrupole: -180.5522 -180.2640 -211.9470
quadrupole: 0.0206 0.1095 -19.8563
quadrupole: 10.3688 10.6571 -21.0259 0.0206 0.1095 -19.8563
hfenergy: -1605.9541458 hartree
pointgroup: C01 [X(C28H24O7)]
dipole: -0.0019324 -1.5761639 -2.0445761 debye
polarizability: 463.2305539|-0.1144527|371.3716799|-0.258042|-14.6422139|222.5304961 unknown
InChI: InChI=1S/C28H24O7/c1-3-7-25(29)32-17-11-13-21-23(15-17)34-24-16-18(33-26(30)8-4-2)12-14-22(24)28(21)20-10-6-5-9-19(20)27(31)35-28/h5-6,9-16H,3-4,7-8H2,1-2H3
charge 0 multiplicity 1
59 atoms
O  0.000878 1.934372 1.466259
O  -0.002599 -1.692012 0.295838
O  0.002866 4.109589 2.325207
O  -4.71333 -2.062265 0.048257
O  4.707594 -2.069613 0.047542
O  -6.495075 -0.56677 -0.352451
O  6.488699 -0.581196 -0.381202
C  -0.000242 1.265461 0.054725
C  0.000384 2.48349 -0.868038
C  -1.257842 0.422172 -0.025038
C  1.255895 0.420086 -0.026015
C  0.001572 3.673428 -0.114552
C  -1.208826 -0.983602 0.144953
C  1.204679 -0.985588 0.144079
C  0.001912 3.350144 1.33947
C  -0.000087 2.526471 -2.273881
C  -2.535178 1.01155 -0.187484
C  2.534089 1.007367 -0.189377
C  0.002302 4.943035 -0.726606
C  -2.373482 -1.772171 0.161566
C  2.368058 -1.776076 0.159969
C  -3.72286 0.258375 -0.178908
C  3.720523 0.252224 -0.181557
C  0.000643 3.795628 -2.901905
C  -3.622938 -1.146381 0.002792
C  3.618402 -1.152345 0.000241
C  0.001817 4.99363 -2.138382
C  -6.07974 -1.720328 -0.131447
C  6.073036 -1.732065 -0.147102
C  -6.912372 -2.983947 -0.014517
C  6.90405 -2.996622 -0.02873
C  -8.427444 -2.722959 -0.13025
C  8.420288 -2.735732 -0.129016
C  -9.240939 -4.031386 -0.053403
C  9.232032 -4.045666 -0.059625
H  -0.000979 1.606838 -2.868106
H  -2.603471 2.09699 -0.315017
H  2.604074 2.092686 -0.317015
H  0.003219 5.850132 -0.113733
H  -2.305279 -2.853973 0.294444
H  2.298167 -2.857729 0.293182
H  -4.693361 0.736818 -0.302724
H  4.691662 0.7290 -0.306757
H  0.000306 3.85615 -3.99578
H  0.002363 5.960804 -2.652109
H  -6.663425 -3.472445 0.947779
H  -6.572265 -3.688548 -0.799607
H  6.571824 -3.695657 -0.822362
H  6.645155 -3.491594 0.927398
H  -8.63565 -2.199539 -1.081885
H  -8.74155 -2.031436 0.673756
H  8.636671 -2.201953 -1.072971
H  8.728343 -2.05354 0.685326
H  -10.323819 -3.828131 -0.133267
H  -9.067756 -4.558327 0.90396
H  -8.967307 -4.72305 -0.872501
H  10.315718 -3.842565 -0.128096
H  8.964715 -4.727921 -0.888649
H  9.050281 -4.583005 0.890327
