program: Gaussian 09
title: 000078456
version: EM64L-G09RevD.01
frameworkgroup: C1[X(C3H6O5P2)]
method: RPBEPBE
basis: SDD
operation: Freq
keyword: #pfreq=noraman
keyword: PBEPBE/SDD
title: #p freq=noraman PBEPBE/SDD
converged: NO NO NO NO
title: Mulliken charges:
elementType: P P O O O O O C C C H H H H H H
charge: 0.864309 1.394015 -0.456931 -0.457147 -0.457060 -0.609389 -0.546143 -0.478494 -0.478748 -0.478554 0.283975 0.283962 0.284002 0.284144 0.283961 0.284098
chargesum: 0.00000
title: Mulliken charges with hydrogens summed into heavy atoms:
elementType: P P O O O O O C C C
charge: 0.864309 1.394015 -0.456931 -0.457147 -0.457060 -0.609389 -0.546143 0.089443 0.089397 0.089505
polarizability: 1.13964932e+02 -4.53086861e-04 7.52175492e+01 -1.35598896e-03 2.98399320e-03 7.52044831e+01
1716.lowfreq: -146.9655 -17.6200 0.0010 0.0016 0.0025 7.0816 12.1232 132.9465 134.0896
frequency: -146.9608 132.9354 134.0475 182.6792 183.0209 237.6245 238.4450 300.1031 300.9063 329.9009 330.2516 347.7606 492.4227 544.8933 634.7366 635.4018 654.0885 694.0562 695.3507 768.0812 865.3816 865.9247 931.8072 932.1548 965.0194 997.6877 1115.1093 1131.6731 1154.4210 1155.3451 1269.3371 1269.5937 1295.0344 1427.3030 1428.3814 1442.9977 3030.4338 3030.7770 3032.2481 3112.3166 3113.2971 3113.8398
redmass: 3.2664 2.9378 2.9637 13.4547 13.5077 4.2123 4.1844 12.7827 12.7610 8.1985 8.1276 18.0967 8.9836 9.0506 10.0920 10.0907 5.5584 5.4529 5.4656 1.2835 3.0770 3.0438 2.6323 2.6539 12.4875 15.5640 19.7248 1.0669 1.0506 1.0505 1.2068 1.2062 1.1951 1.0718 1.0717 1.0695 1.0546 1.0546 1.0556 1.1101 1.1116 1.1116
irintensity: 0.0034 21.2957 21.4962 5.7967 5.8537 7.7960 7.5546 22.7061 22.8292 0.8175 0.9092 1.2228 30.6267 10.3045 135.2247 135.2353 22.2049 0.9291 1.0026 0.0004 4.4054 4.2241 51.5467 51.6067 263.1214 23.3773 189.0830 0.0051 2.6839 2.7080 0.9795 0.9791 6.4452 5.3410 5.3837 1.8042 12.6577 12.7731 16.3083 0.1685 3.1937 3.0588
temp: 298.150 k
press: 1.00000 atm
elementType: 15 15 8 8 8 8 8 6 6 6 1 1 1 1 1 1
symmnumber: 1
zpe: 266269.5 jmol-1
zpe.correction: 0.101417 hartree
zpe.thermalcorrener: 0.111344 hartree
zpe.thermalcorrenthalpy: 0.112288 hartree
zpe.thermalcorrgfe: 0.066472 hartree
zpe.sumelectzpe: -1175.612187 hartree
zpe.sumelectthermal: -1175.602260 hartree
zpe.sumelectthermalent: -1175.601316 hartree
zpe.sumelectthermalfe: -1175.647132 hartree
dipole: -3.3009 -0.0009 0.0040
dipole: 3.3009
quadrupole: -103.4852 -68.8682 -68.8768
quadrupole: -0.0019 -0.0066 -0.0034
quadrupole: -23.0752 11.5418 11.5333 -0.0019 -0.0066 -0.0034
hfenergy: -1175.7136039 hartree
pointgroup: C01 [X(C3H6O5P2)]
dipole: 1.2986654 0.0007047 0.0015575 debye
dipolederiv: 1.2033433 0.0000631 -0.0001117 -0.0002076 0.9396498 -0.0000438 0.000155 -0.0000078 0.9401549 2.3225043 0.0001405 0.0005378 -0.0002012 1.6719438 -0.0006225 -0.0003318 0.0006677 1.6715483 -1.1308091 -0.1721762 0.2469079 -0.1102384 -0.5386816 0.149699 0.158681 0.1494227 -0.6491219 -1.1314614 -0.1283286 -0.2730804 -0.0822993 -0.492667 -0.1227175 -0.1749312 -0.1228962 -0.695558 -1.1310499 0.3002835 0.0254383 0.1927264 -0.7512718 -0.026468 0.0160409 -0.0264782 -0.4368122 -0.7328781 0.0000851 -0.0000845 -0.0000547 -0.5557205 -0.0000434 -0.0000124 0.0000236 -0.55559 -0.6070513 -0.0000611 0.0000214 -0.0000645 -0.5014393 -0.0000905 0.000194 0.0001221 -0.5013504 0.3984744 0.1576727 -0.2268575 -0.0049534 0.0408246 0.0054736 0.0060435 0.0051342 0.0381106 0.3987666 0.1178143 0.2502041 -0.0019298 0.0439417 -0.0034325 -0.0074326 -0.0039937 0.0349042 0.398538 -0.2755041 -0.0230359 0.0074981 0.0343014 -0.0014943 0.0019178 -0.0021465 0.0448589 0.0019479 -0.0171833 0.0494381 0.0263812 0.0785014 -0.0446178 0.0425992 -0.0287056 -0.0423112 0.0018186 -0.0404122 0.033315 -0.0490717 -0.0513754 0.019132 -0.0098872 0.0029973 0.0877253 0.0019911 -0.034069 -0.0395205 -0.0502391 -0.0443688 -0.0417928 0.0016321 -0.0257797 0.0800373 0.0019302 -0.0087891 -0.0518256 0.0328133 0.0631734 0.0623412 -0.0377396 0.0465866 -0.0261793 0.0020656 0.0512362 -0.0097508 0.0236225 0.0197975 0.0625387 -0.0442871 0.078801 0.0160785 0.0018701 0.0492282 0.0184043 0.0162183 0.0433907 -0.0578615 0.0473585 -0.0737476 -0.006495 unknown
polarizability: 113.9649309|-0.0020896|75.2149991|0.0059534|-0.0059771|75.2070342 unknown
InChI: InChI=1S/C3H6O5P2/c4-9-1-6-10(5,7-2-9)8-3-9/h1-3H2
charge 0 multiplicity 1
16 atoms
P  1.578386 -0.000535 0.000053
P  -1.522487 -0.000114 -0.000198
O  -0.782077 0.90506 -1.294637
O  -0.781185 0.667205 1.430757
O  -0.781949 -1.573394 -0.137624
O  3.190893 -0.000631 -0.000377
O  -3.08767 0.000015 0.000056
C  0.705327 0.973394 -1.39613
C  0.705895 0.72293 1.540678
C  0.705261 -1.696334 -0.144407
H  0.998474 0.55082 -2.371271
H  1.000489 2.033969 -1.33675
H  0.99794 1.779254 1.660285
H  1.001424 0.143268 2.43066
H  0.997209 -2.328597 0.710223
H  1.001072 -2.176408 -1.091719
