program: Gaussian 09
title: 000078574
version: EM64L-G09RevD.01
frameworkgroup: C1[X(C18H28N3O3)]
method: RPBEPBE
basis: SDD
operation: Freq
keyword: #p
keyword: freq=noraman
keyword: PBEPBE/SDD
title: #p freq=noraman PBEPBE/SDD
converged: YES YES NO NO
title: Mulliken charges:
elementType: O O O N N N C C C C C C C C C C C C C C C C C C H H H H H H H H H H H H H H H H H H H H H H H H H H H H
charge: -0.216287 -0.290285 -0.239515 -0.161706 -0.015254 0.089956 -0.380916 -0.374304 0.359395 -0.297452 -0.306029 0.292620 -0.483162 0.214389 -0.498574 0.281365 -0.299324 -0.387023 -0.306248 -0.382938 -0.341204 -0.341596 -0.674834 -0.674904 0.230555 0.259406 0.251772 0.277911 0.250682 0.205582 0.214588 0.245378 0.284211 0.297031 0.224844 0.225179 0.212837 0.216258 0.227868 0.229661 0.223224 0.224246 0.200765 0.201191 0.199405 0.198707 0.215133 0.235105 0.214802 0.217254 0.233287 0.216945
chargesum: 1.00000
title: Mulliken charges with hydrogens summed into heavy atoms:
elementType: O O O N N N C C C C C C C C C C C C C C C C C C
charge: -0.216287 -0.290285 -0.239515 -0.161706 -0.015254 0.089956 0.109045 0.155379 0.359395 0.158813 0.153936 0.292620 -0.198951 0.214389 -0.201543 0.281365 0.150699 0.042072 0.151281 0.064531 0.060752 0.056515 -0.009793 -0.007417
polarizability: 3.34925367e+02 -6.00477686e+01 3.33377380e+02 6.88132640e+00 -5.57281117e+00 1.42660041e+02
1716.lowfreq: -19.6907 -6.7193 -0.0011 -0.0005 0.0009 3.0840 9.5214 27.1755 33.8044
frequency: -13.7486 26.9269 33.7287 35.4700 39.1758 47.2363 60.5582 64.2879 71.1847 98.3647 116.0104 118.4373 137.1566 140.4092 153.5507 170.7234 176.2189 185.7806 198.1255 219.1192 235.6122 239.7621 265.1266 278.9797 300.5817 312.5552 356.3798 363.4335 372.1511 407.6538 425.6860 444.1852 451.8891 455.2095 471.4279 475.4281 507.0389 555.0668 574.3559 640.0040 666.6752 671.2087 707.0728 715.1548 742.2764 746.2455 789.7351 808.0865 812.4390 814.8838 829.4942 836.4029 843.0489 887.3171 900.5582 910.4205 914.6637 919.3349 936.8137 941.5150 944.1153 996.7397 1025.0057 1037.2083 1038.0866 1046.5058 1069.9993 1076.1635 1078.1344 1100.3077 1122.1558 1122.9582 1125.8875 1141.9110 1142.7370 1149.1811 1192.8447 1195.3644 1213.4028 1214.5203 1227.0177 1254.5515 1267.1856 1272.9587 1274.6310 1280.2444 1281.8119 1284.2501 1285.7196 1288.6401 1291.0314 1329.6492 1339.8491 1341.9393 1344.6445 1347.5635 1357.8340 1368.2287 1373.7632 1383.0168 1399.2966 1399.5140 1401.7371 1441.7050 1450.7466 1451.2615 1460.0369 1463.9258 1468.7966 1469.9295 1471.9444 1477.5123 1479.1250 1480.8539 1481.3422 1487.8593 1489.6151 1493.4050 1500.6894 1537.8533 1611.6070 2057.9832 2962.8523 2963.1760 2969.8803 2974.4320 2974.5816 2974.8337 2984.4234 2985.6603 2994.8366 2995.5886 2998.0117 3001.9645 3016.6723 3018.2614 3027.9421 3039.7926 3064.8392 3072.8877 3081.5403 3084.1552 3089.8160 3089.8763 3095.2837 3097.9971 3105.4253 3155.4339 3190.2408 3198.3060
redmass: 3.1183 3.6686 2.6208 2.8956 3.9759 4.1459 1.8736 3.3663 3.6040 3.3517 2.6566 6.8187 3.8172 2.2778 2.4706 3.4672 3.5480 6.0911 4.2226 2.9228 1.1291 1.0982 5.6480 4.7064 2.9566 3.5905 3.6875 5.9604 3.8527 2.4479 2.7382 4.0412 3.3647 5.5890 8.8915 3.7107 4.5681 8.0599 3.0000 3.1543 5.1349 5.5122 4.2565 3.6445 1.0783 1.0781 5.2531 1.2520 1.2378 2.9991 1.6495 1.4153 1.8287 3.5754 2.5197 2.6208 2.1985 3.2364 1.1584 4.8278 1.1689 2.7248 2.4982 3.3743 3.3643 2.1007 4.1104 2.3316 2.3338 2.2580 3.1023 2.6202 3.9308 1.4345 1.4414 3.8107 1.6704 1.7992 1.3633 1.3635 1.7751 1.2571 1.3878 1.3239 1.3448 1.3760 1.1773 1.1602 1.0645 1.4453 1.0866 1.3152 1.4346 1.2841 1.6658 1.4775 1.6480 1.3556 1.3729 1.5925 1.2562 1.2100 3.0736 1.1488 1.1491 1.0813 1.0943 1.1578 1.0943 1.0788 1.0716 1.1079 1.0710 1.0419 1.0416 1.2331 1.0993 2.4689 5.9731 4.3394 6.1483 13.8958 1.0553 1.0679 1.0584 1.0598 1.0562 1.0676 1.0365 1.0363 1.0601 1.0639 1.0670 1.0588 1.1012 1.1010 1.1071 1.1071 1.1059 1.1060 1.1015 1.1021 1.0996 1.0994 1.0952 1.1010 1.0984 1.0929 1.0919 1.0896
irintensity: 0.0271 0.3166 0.4393 0.0706 0.3121 0.0896 0.1394 0.7758 0.7120 1.2573 0.1266 0.7669 0.4949 2.1512 2.6865 0.1582 0.4863 5.3276 1.3207 2.9786 0.0857 0.0874 1.9269 2.6536 14.6938 11.9745 0.9879 0.0495 3.3354 0.2590 1.2944 1.4263 8.4116 3.5191 2.3909 4.7683 15.2583 0.8632 37.9254 4.4657 1.9924 3.0201 4.4919 4.0843 11.5853 11.8572 7.9263 5.5240 6.2111 4.6357 11.2585 19.9475 16.3072 45.9651 26.3936 7.3033 10.0039 29.4991 1.2569 247.3810 2.9359 12.7179 48.9066 38.2966 20.0583 24.2049 40.5316 9.7019 14.1644 8.8956 4.6162 0.4468 11.3924 3.1133 2.5353 29.0567 224.4585 216.8912 0.1888 0.0906 49.4798 45.5135 22.0218 7.5967 4.7289 3.1097 0.4469 0.1098 1.1728 95.8159 4.5033 1.7806 1.8929 4.4018 23.0876 10.4568 16.1644 33.2940 15.1924 15.7077 9.5045 9.0436 11.8845 13.2894 74.8575 3.4095 5.7381 53.9070 8.2454 0.0758 0.0025 41.9327 12.9562 15.6692 15.8442 20.6070 13.1853 108.6350 23.6813 391.5321 303.2257 838.8568 11.0556 38.4338 12.5766 21.5471 17.7085 42.3560 25.9791 26.7613 31.6090 11.0215 53.9198 23.9284 11.8012 9.9642 2.4012 3.2597 22.5989 10.4745 76.4693 85.5270 34.6949 29.9282 15.7892 11.1994 17.5581 6.9149 2.7405 0.7293
temp: 298.150 k
press: 1.00000 atm
elementType: 8 8 8 7 7 7 6 6 6 6 6 6 6 6 6 6 6 6 6 6 6 6 6 6 1 1 1 1 1 1 1 1 1 1 1 1 1 1 1 1 1 1 1 1 1 1 1 1 1 1 1 1
symmnumber: 1
zpe: 1154585.0 jmol-1
zpe.correction: 0.439758 hartree
zpe.thermalcorrener: 0.465059 hartree
zpe.thermalcorrenthalpy: 0.466004 hartree
zpe.thermalcorrgfe: 0.382537 hartree
zpe.sumelectzpe: -1090.480537 hartree
zpe.sumelectthermal: -1090.455236 hartree
zpe.sumelectthermalent: -1090.454292 hartree
zpe.sumelectthermalfe: -1090.537759 hartree
dipole: 0.9699 -1.0932 -0.1902
dipole: 1.4738
quadrupole: -78.4856 -121.9435 -139.0449
quadrupole: 15.2796 1.6910 -0.0639
quadrupole: 34.6724 -8.7855 -25.8869 15.2796 1.6910 -0.0639
hfenergy: -1090.9202956 hartree
pointgroup: C01 [X(C18H28N3O3)]
dipole: -0.443354 0.3712445 -0.0426249 debye
polarizability: 351.6002049|-56.2833887|314.9708826|-17.7016457|14.0533333|144.3917 unknown
InChI: InChI=1S/C18H28N3O3/c1-3-5-9-23-17-14-16(21-7-11-22-12-8-21)18(13-15(17)20-19)24-10-6-4-2/h13-14H,3-12H2,1-2H3
charge 1 multiplicity 1
52 atoms
O  2.872131 -3.96562 0.321692
O  2.396506 0.831708 0.181908
O  -3.215446 0.570712 0.521727
N  1.109706 -1.681283 -0.041909
N  -1.970983 2.922132 0.658923
N  -2.665419 3.854468 0.805256
C  0.562946 -3.023961 0.306267
C  2.409165 -1.799788 -0.776257
C  0.380066 -0.52772 0.123195
C  1.634067 -3.831311 1.085375
C  3.421446 -2.634127 0.03063
C  1.008304 0.801931 0.206829
C  -1.048767 -0.598263 0.259326
C  -1.847039 0.535848 0.432267
C  0.226022 1.939202 0.379189
C  -1.200121 1.827664 0.492225
C  3.095046 2.136549 0.381171
C  4.59783 1.86294 0.351993
C  -3.994086 -0.710933 0.478478
C  -5.46924 -0.354601 0.642602
C  5.412761 3.159445 0.589868
C  -6.35787 -1.623972 0.610833
C  6.933984 2.900839 0.55544
C  -7.855222 -1.284794 0.770468
H  -0.32444 -2.926221 0.950596
H  0.28793 -3.56599 -0.619622
H  2.187762 -2.328739 -1.724855
H  2.813096 -0.806048 -0.996515
H  1.270544 -4.856468 1.260386
H  1.831521 -3.338007 2.061154
H  3.68753 -2.110808 0.972517
H  4.331028 -2.80994 -0.564415
H  -1.542429 -1.563276 0.142745
H  0.6830 2.9264 0.469217
H  2.794527 2.827298 -0.432513
H  2.780147 2.555465 1.358617
H  4.875284 1.426339 -0.626536
H  4.849292 1.117806 1.130631
H  -3.635149 -1.359345 1.302152
H  -3.798877 -1.198569 -0.497065
H  -5.614359 0.179506 1.600287
H  -5.77273 0.334286 -0.167815
H  5.149239 3.911638 -0.180765
H  5.135017 3.597761 1.56949
H  -6.202516 -2.163854 -0.345113
H  -6.049031 -2.315595 1.420648
H  7.234679 2.180458 1.338323
H  7.498218 3.834611 0.723673
H  7.247303 2.489981 -0.42201
H  -8.203348 -0.621023 -0.041988
H  -8.472816 -2.199493 0.745218
H  -8.048904 -0.774038 1.731463
