program: Gaussian 09
title: 000078594
version: EM64L-G09RevD.01
frameworkgroup: C1[X(C14H15N3O3S)]
method: RPBEPBE
basis: SDD
operation: Freq
keyword: #p
keyword: freq=noraman
keyword: PBEPBE/SDD
title: #p freq=noraman PBEPBE/SDD
converged: YES YES NO NO
title: Mulliken charges:
elementType: S O O O N N N C C C C C C C C C C C C C C H H H H H H H H H H H H H H H
charge: 0.284587 -0.254537 -0.189885 -0.171326 0.068087 -0.064114 0.001887 -0.351082 0.327285 -0.324202 0.352664 -0.377823 -0.288442 -0.352423 -0.412701 0.213638 0.226127 -0.248796 -0.763557 -0.766651 -0.681607 0.287299 0.266955 0.267609 0.261691 0.215458 0.215524 0.269256 0.242254 0.281765 0.256949 0.254866 0.270184 0.212671 0.235276 0.235110
chargesum: 0.00000
title: Mulliken charges with hydrogens summed into heavy atoms:
elementType: S O O O N N N C C C C C C C C C C C C C C
charge: 0.284587 -0.254537 -0.189885 -0.171326 0.068087 -0.064114 0.001887 -0.351082 0.327285 -0.036902 0.352664 -0.110867 -0.020833 -0.090732 -0.412701 0.213638 0.226127 0.182186 0.029719 0.015348 0.001451
polarizability: 5.15113532e+02 8.47571289e+00 1.85536522e+02 6.97164753e+00 1.79302646e+01 1.32457362e+02
1716.lowfreq: -9.3631 -4.1437 -0.4646 0.0013 0.0016 0.0017 10.9953 25.2688 39.3170
frequency: 10.4611 25.2357 39.2900 46.1551 51.7153 66.6656 79.3071 104.3614 115.8347 141.5634 162.6582 167.5946 170.4102 184.3076 194.5764 231.5794 244.0959 259.1664 282.1568 293.0969 307.3817 316.6295 386.3898 403.7485 419.0025 439.6270 444.1164 490.4819 508.9632 523.6144 544.1229 566.9378 588.8321 601.3645 613.4312 618.4738 672.1596 737.0679 744.4879 784.3983 799.8739 817.3350 831.8950 839.1774 845.2718 874.1431 921.4851 933.7713 951.8270 968.0389 1011.3792 1017.3513 1032.3891 1032.9776 1042.3173 1073.1587 1115.9463 1121.8620 1134.9329 1145.5116 1204.2010 1209.5151 1255.5683 1260.4779 1263.5443 1268.3004 1285.0753 1334.2024 1356.6815 1370.3157 1372.0196 1374.5867 1402.6100 1411.0929 1429.8899 1433.7355 1443.1017 1448.7182 1450.1653 1460.3117 1461.8439 1478.7503 1489.9006 1547.5224 1611.2556 1636.6127 1650.7274 2962.3402 2981.5900 2982.4562 3000.3275 3015.2135 3023.3613 3064.7842 3066.4865 3097.7700 3110.1174 3126.5654 3132.1330 3164.6820 3174.7722 3184.8870
redmass: 4.8550 6.4777 4.6310 5.9989 4.8387 5.7042 5.4273 4.0293 1.7477 4.1901 5.5985 1.0901 1.1510 3.9358 4.7263 6.2192 1.2888 6.4955 6.2943 5.5277 3.9462 4.5200 6.5548 7.1699 5.7627 3.8290 4.8440 4.2471 6.0216 4.2346 4.4924 6.4682 3.8160 3.4666 4.6017 6.9339 6.6569 3.9838 6.9890 4.0387 4.8890 1.2663 1.3785 3.7312 1.3949 4.8627 4.3974 3.5397 1.9607 1.3312 2.1927 2.1669 2.5701 2.3880 2.2509 5.9206 2.0684 1.4122 1.4326 2.5746 2.7459 2.7712 1.4218 2.2630 1.1546 1.4309 2.2758 8.4853 1.8961 1.2743 1.2414 2.0709 1.2807 6.5621 1.0673 5.2774 1.0522 1.0682 1.0759 3.1648 1.0394 1.1125 1.1382 6.9810 6.8398 8.0868 7.9029 1.0554 1.0372 1.0375 1.0364 1.0838 1.1078 1.0956 1.0931 1.0989 1.1016 1.1009 1.1021 1.0882 1.0919 1.0982
irintensity: 0.2652 0.2587 1.8043 2.7713 3.6009 4.0600 0.2555 0.8712 1.9959 5.8436 3.1146 0.4710 0.9501 8.4039 2.4489 0.0964 0.9581 2.2854 3.5236 2.3085 1.9796 9.2922 26.7204 1.2713 7.7260 4.6995 6.8697 23.1902 4.3050 6.9093 12.0259 16.6716 29.5016 18.9101 1.3964 32.8305 1.6784 0.3674 9.9966 59.2435 83.1985 7.6170 48.1363 2.9092 25.2211 152.4489 25.0987 48.7579 20.0517 0.0111 24.8891 17.8305 65.4727 27.2694 7.3818 144.9152 2.4806 10.1894 4.9602 149.5369 510.2059 128.9240 246.9367 112.9005 1.4466 0.5503 45.5253 12.5810 88.4724 116.8302 41.2075 2.7439 22.7635 146.7415 22.3843 6.3839 16.8077 6.6633 64.5070 182.6548 12.8341 6.1152 5.9494 44.5931 366.7871 159.5835 287.9343 29.1180 2.3722 4.5061 30.1000 11.6306 30.3296 2.4662 0.3639 24.3127 31.2232 8.6863 17.6486 0.6619 8.4019 7.2447
temp: 298.150 k
press: 1.00000 atm
elementType: 16 8 8 8 7 7 7 6 6 6 6 6 6 6 6 6 6 6 6 6 6 1 1 1 1 1 1 1 1 1 1 1 1 1 1 1
symmnumber: 1
zpe: 700355.6 jmol-1
zpe.correction: 0.266751 hartree
zpe.thermalcorrener: 0.288373 hartree
zpe.thermalcorrenthalpy: 0.289318 hartree
zpe.thermalcorrgfe: 0.212935 hartree
zpe.sumelectzpe: -1328.872764 hartree
zpe.sumelectthermal: -1328.851142 hartree
zpe.sumelectthermalent: -1328.850198 hartree
zpe.sumelectthermalfe: -1328.926581 hartree
dipole: 7.4197 -2.7275 0.4212
dipole: 7.9163
quadrupole: -124.7615 -118.9341 -139.1031
quadrupole: -0.4484 -8.2531 -0.3017
quadrupole: 2.8381 8.6654 -11.5035 -0.4484 -8.2531 -0.3017
hfenergy: -1329.1395156 hartree
pointgroup: C01 [X(C14H15N3O3S1)]
dipole: 2.8257688 -1.1478086 -0.63077 debye
polarizability: 513.2355136|-28.076622|146.5300809|8.0630145|27.9178679|173.3418216 unknown
InChI: InChI=1S/C14H15N3O3S/c1-4-20-10-5-6-11-12(7-10)21-14(15-11)17-16-13(8(2)18)9(3)19/h5-7,13H,4H2,1-3H3
charge 0 multiplicity 1
36 atoms
S  0.555882 -0.624148 -1.843455
O  5.506211 -0.144979 0.166137
O  -5.819056 2.165419 -1.206993
O  -5.429049 -0.785836 1.106807
N  -0.039648 0.595547 0.501966
N  -2.825545 0.562503 -0.139199
N  -1.959004 0.056106 -0.98379
C  1.88196 -0.198832 -0.703011
C  1.343249 0.43943 0.472927
C  -4.215143 0.447846 -0.669474
C  4.120383 0.005175 0.179235
C  3.262485 -0.422544 -0.864206
C  2.232941 0.856648 1.502476
C  3.604127 0.64032 1.353494
C  -0.6157 0.114308 -0.588509
C  -5.034196 1.717281 -0.332794
C  -4.840002 -0.832809 0.00408
C  6.133499 -0.794319 -1.008401
C  -4.860015 2.313345 1.040165
C  -4.633699 -2.102175 -0.796617
C  7.636564 -0.815507 -0.750646
H  -4.220958 0.28336 -1.764293
H  3.651042 -0.907618 -1.762148
H  1.823813 1.339925 2.393846
H  4.317385 0.947321 2.123373
H  5.725462 -1.819905 -1.115813
H  5.886336 -0.212309 -1.919437
H  -3.785729 2.466201 1.248633
H  -5.424217 3.253673 1.128201
H  -5.216691 1.578699 1.788424
H  -4.849762 -2.987386 -0.17922
H  -5.314309 -2.09531 -1.670336
H  -3.603286 -2.145593 -1.194881
H  8.157923 -1.291646 -1.600614
H  8.026779 0.209269 -0.631263
H  7.86827 -1.385361 0.164933
