program: Gaussian 09
title: 000078446
version: EM64L-G09RevD.01
frameworkgroup: C1[X(C6H12O)]
method: RPBEPBE
basis: SDD
operation: Freq
keyword: #pfreq=noraman
keyword: PBEPBE/SDD
title: #p freq=noraman PBEPBE/SDD
converged: NO YES NO NO
title: Mulliken charges:
elementType: O C C C C C C H H H H H H H H H H H H
charge: -0.238786 -0.027446 -0.394920 -0.394919 -0.317649 -0.317650 -0.717507 0.192654 0.195074 0.205010 0.205011 0.195073 0.217859 0.173733 0.173734 0.217860 0.211525 0.209818 0.211525
chargesum: 0.00000
title: Mulliken charges with hydrogens summed into heavy atoms:
elementType: O C C C C C C
charge: -0.238786 0.165209 0.005164 0.005165 0.073943 0.073944 -0.084639
polarizability: 7.00679277e+01 5.05590388e-05 6.91107837e+01 -5.17279064e-01 2.99997437e-05 5.68833364e+01
1716.lowfreq: 0.0005 0.0008 0.0010 2.9647 17.5957 20.9626 152.9169 201.6032 232.6062
frequency: 152.9166 201.6001 232.5971 296.9054 326.9143 390.8558 432.0002 459.7536 575.5395 770.6704 802.3258 804.6114 868.9232 950.9906 971.3800 979.2746 981.1080 1013.2811 1071.6081 1090.2350 1147.1140 1152.9874 1170.2933 1228.9406 1253.3698 1263.0566 1300.6542 1303.6147 1334.0311 1348.6018 1353.4129 1373.2037 1387.5660 1440.9835 1452.6574 1456.9192 1462.8711 1473.5339 1476.2786 2911.9580 2916.9384 2940.4174 2964.6039 2971.4151 2975.4075 3032.9863 3038.3071 3061.6688 3063.8850 3067.7093 3071.4212
redmass: 2.9137 1.0655 1.6672 2.3507 2.1029 4.3086 1.8551 2.8909 2.0656 2.9257 1.5424 2.8719 2.1647 1.3544 1.2796 1.6552 1.9822 2.3048 5.1519 2.4405 1.2604 2.2329 1.8739 1.2924 1.2902 1.3127 1.3383 1.2057 1.2920 1.3362 1.6224 1.2842 1.2175 1.0905 1.0920 1.0814 1.0949 1.0467 1.0571 1.0699 1.0698 1.0822 1.0368 1.0589 1.0593 1.1022 1.1019 1.0991 1.0994 1.0934 1.0954
irintensity: 3.1557 0.2708 0.7052 0.0030 8.0240 1.4480 0.5895 0.0007 7.9281 1.0757 0.2177 14.1209 2.1524 0.5112 9.8643 7.1520 10.1514 11.1077 50.8718 5.2865 5.3505 3.2612 21.0594 8.8682 6.8079 1.3096 0.0171 0.8456 0.7040 6.7305 11.3303 0.8059 9.9513 3.7450 13.9073 2.9495 7.5631 14.5175 7.5509 33.8843 106.7769 37.4852 25.4686 47.9209 35.8713 34.7384 47.3991 64.0707 42.3268 47.2424 48.5884
temp: 298.150 k
press: 1.00000 atm
elementType: 8 6 6 6 6 6 6 1 1 1 1 1 1 1 1 1 1 1 1
symmnumber: 1
zpe: 447225.7 jmol-1
zpe.correction: 0.170339 hartree
zpe.thermalcorrener: 0.177478 hartree
zpe.thermalcorrenthalpy: 0.178422 hartree
zpe.thermalcorrgfe: 0.139673 hartree
zpe.sumelectzpe: -310.462518 hartree
zpe.sumelectthermal: -310.455380 hartree
zpe.sumelectthermalent: -310.454436 hartree
zpe.sumelectthermalfe: -310.493185 hartree
dipole: 1.7430 0.0000 1.0125
dipole: 2.0157
quadrupole: -50.1654 -40.9209 -44.2648
quadrupole: 0.0000 -1.7807 0.0000
quadrupole: -5.0484 4.1961 0.8522 0.0000 -1.7807 0.0000
hfenergy: -310.6328576 hartree
pointgroup: C01 [X(C6H12O1)]
dipole: 0.6932129 0.0000245 0.3851784 debye
dipolederiv: -0.5671419 0.0000099 0.0351122 0.0000088 -0.8383665 0.0000029 0.033794 0.0000023 -0.4113211 0.0721031 0.0000002 0.0178763 0.000001 0.0717775 0.0000007 0.052967 0.0000015 0.1637389 -0.1491568 -0.0032508 0.0190973 -0.0328522 0.0166266 -0.0286142 0.04568 0.0081656 0.1147319 -0.1491596 0.0032411 0.019095 0.0328423 0.01663 0.0286167 0.0456818 -0.0081599 0.1147296 0.3647312 -0.1797438 -0.0142382 -0.0980975 0.5505049 -0.068467 -0.0672276 -0.1431764 0.4005677 0.3647115 0.1797308 -0.0142418 0.0980854 0.5505203 0.0684642 -0.0672354 0.1431683 0.4005636 -0.0667187 -0.0000052 0.036568 -0.0000061 0.0610243 0.0000011 0.0059502 0.0000004 0.0926249 0.027898 0.0000002 0.0523964 0.0000003 0.0229509 0.0000018 0.0115026 0.0000005 -0.211698 0.0096314 0.1276491 -0.0384425 0.0818796 -0.143071 0.059987 -0.0428929 0.091053 0.0495233 0.0395889 -0.0142664 0.0348868 -0.0257315 0.0717986 0.0211113 0.0366585 -0.0457217 -0.1666353 0.0395874 0.0142635 0.0348883 0.0257289 0.0718024 -0.0211112 0.0366551 0.0457226 -0.1666333 0.0096455 -0.1276397 -0.038438 -0.0818699 -0.1430861 -0.0599891 -0.0428863 -0.0910556 0.049524 -0.0358175 -0.0978402 -0.0351928 -0.0922206 -0.1104159 -0.0371658 -0.0617407 -0.077459 0.0563358 0.0187081 0.058451 -0.0002455 0.0386521 0.0030399 -0.0222501 0.0534477 0.1043044 -0.243502 0.0187167 -0.0584508 -0.0002498 -0.0386519 0.0030344 0.0222524 0.053452 -0.1042982 -0.2434994 -0.0358303 0.0978451 -0.0351949 0.0922255 -0.1104026 0.0371619 -0.0617455 0.0774534 0.0563377 -0.0133528 0.0864727 -0.0212853 0.153955 -0.0921177 0.0741891 -0.0438236 0.0770341 0.0580977 0.0651889 -0.0000012 -0.0311128 -0.0000006 0.0898867 -0.0000026 0.0555795 0.0000011 -0.1715849 -0.0133331 -0.0864655 -0.0212786 -0.1539486 -0.0921367 -0.0741891 -0.0438163 -0.0770362 0.0580988 unknown
polarizability: 70.0433755|0.0000851|69.1107837|-0.7685606|0.0000055|56.9078886 unknown
charge 0 multiplicity 1
19 atoms
O  -1.85178 -0.000052 -0.294396
C  1.047302 0.000047 0.325651
C  0.298689 -1.262212 -0.176349
C  0.298603 1.262253 -0.176352
C  -1.191944 -1.212396 0.216332
C  -1.192022 1.212336 0.216335
C  2.529211 0.0001 -0.103835
H  1.003221 0.000044 1.437783
H  0.760677 -2.179494 0.241447
H  0.38144 -1.319498 -1.280283
H  0.381351 1.319535 -1.280284
H  0.760529 2.179569 0.241442
H  -1.760216 -2.051396 -0.219517
H  -1.290954 -1.248726 1.32675
H  -1.291026 1.248652 1.326751
H  -1.760351 2.051298 -0.219507
H  3.057586 -0.894686 0.276379
H  2.616271 0.000096 -1.207619
H  3.057515 0.894929 0.276373
