program: Gaussian 09
title: 000081550
version: EM64L-G09RevD.01
frameworkgroup: C1[X(C21H18ClNO5)]
method: RPBEPBE
basis: SDD
operation: Freq
keyword: #p
keyword: freq=noraman
keyword: PBEPBE/SDD
title: #p freq=noraman PBEPBE/SDD
converged: YES YES NO NO
title: Mulliken charges:
elementType: Cl O O O O O N C C C C C C C C C C C C C C C C C C C C C H H H H H H H H H H H H H H H H H H
charge: -0.037348 -0.362613 -0.316811 -0.279365 -0.280073 -0.188202 -0.481060 0.396876 0.433826 0.054595 -0.551973 0.327159 -0.539463 0.118872 -0.414215 0.357040 -0.415961 0.124864 -0.239507 -0.235370 -0.458784 0.485494 -0.273803 -0.368594 0.261294 -0.535351 -0.767152 -0.517808 0.289848 0.265686 0.251367 0.246130 0.409125 0.232883 0.231758 0.339348 0.264909 0.240060 0.240687 0.227509 0.244975 0.251723 0.281910 0.226983 0.221792 0.236739
chargesum: 0.00000
title: Mulliken charges with hydrogens summed into heavy atoms:
elementType: Cl O O O O O N C C C C C C C C C C C C C C C C C C C C C
charge: -0.037348 -0.362613 -0.316811 -0.279365 -0.280073 -0.188202 -0.071935 0.396876 0.433826 0.054595 -0.262125 0.327159 -0.273777 0.118872 -0.162847 0.357040 -0.169830 0.124864 -0.006623 -0.003612 -0.119435 0.485494 -0.008894 -0.368594 0.261294 0.172905 0.011456 0.167706
polarizability: 4.87402902e+02 -2.91197070e+01 2.94676867e+02 -7.99525012e+00 -6.36823182e+00 1.31035972e+02
1716.lowfreq: -4.1268 0.0010 0.0015 0.0015 2.7122 5.9263 20.3804 23.7217 42.2895
frequency: 20.2276 23.6507 42.2870 52.8254 53.4444 63.2130 70.5068 80.9990 90.1631 99.4964 116.5916 131.0038 144.4050 148.7786 161.5934 162.8539 166.9144 186.5096 200.1657 243.5588 247.0801 266.1535 283.2631 285.6239 307.2647 317.5176 329.1609 348.0199 361.3455 415.0632 424.9440 441.6119 464.5030 473.3441 481.2500 490.7768 531.9775 544.2224 553.5997 560.3655 584.0912 605.7011 619.6220 636.7940 657.1545 679.8001 707.6486 711.5638 726.8331 751.1495 761.2744 764.8225 781.4860 796.7335 822.7849 825.3560 837.5729 862.0775 871.9131 905.0551 908.2792 912.2908 937.5034 949.6252 976.2066 989.6030 995.6079 996.1187 1011.8223 1021.7315 1032.0097 1050.3790 1112.0809 1116.0760 1123.7960 1136.9945 1149.0558 1152.2238 1161.8238 1169.1829 1169.8855 1175.7249 1210.7431 1233.7153 1241.0557 1261.8103 1277.5459 1284.3134 1325.1685 1367.2344 1385.2448 1393.5695 1402.2257 1427.9976 1435.2612 1437.0667 1442.5070 1453.2006 1455.8885 1459.1557 1461.9763 1469.3976 1470.1892 1471.2022 1484.5347 1506.5244 1510.9406 1565.4829 1582.8960 1588.9141 1604.0470 1605.7714 1640.7823 1691.6640 2965.3459 2969.2746 3000.2566 3058.6112 3060.9703 3091.9586 3123.1262 3126.2589 3126.8300 3132.6702 3141.7816 3146.7530 3148.0366 3165.6514 3172.7546 3181.0408 3196.3003 3416.5329
redmass: 6.2793 7.0865 6.7067 3.8250 6.3928 3.9719 3.5884 4.3030 5.0073 5.2597 1.1542 4.2074 4.4841 3.9969 4.4937 1.7528 3.5254 5.0810 2.0704 2.8574 4.7980 2.0874 6.1792 6.3901 5.3444 5.6772 5.5490 5.2808 7.2611 6.0203 5.3383 6.9810 3.4986 4.6442 2.6104 5.7167 4.0439 4.8644 6.6398 3.7809 5.6221 5.6244 6.8472 6.1196 6.0181 8.2982 6.5014 6.2001 3.0015 4.9315 2.9265 1.7215 2.5250 5.1509 1.6215 1.8567 1.9336 1.5704 4.0868 3.4026 2.1502 6.1204 1.4575 1.5152 1.4527 6.8191 2.1230 1.4038 4.9515 2.3768 4.8387 1.6202 1.2432 1.2567 2.6860 1.8044 1.5127 1.6826 1.8153 2.2878 1.8309 1.1575 2.3329 1.3095 1.6572 3.4440 1.7496 4.6410 2.2749 8.1761 3.8500 1.2296 5.4558 3.6792 1.6563 1.9326 1.3824 1.9588 1.3054 1.0646 1.0563 1.0838 1.4807 1.0805 1.4203 4.0108 2.6582 6.3513 8.4705 5.3043 6.0907 4.9382 6.7073 10.1314 1.0314 1.0324 1.0381 1.1044 1.1044 1.0952 1.1010 1.0858 1.1003 1.0891 1.1018 1.0925 1.0944 1.1006 1.0924 1.0912 1.0925 1.0783
irintensity: 0.6078 0.9176 0.7147 2.2659 1.0674 6.3264 3.5797 1.3284 2.8946 1.3034 0.1064 4.3092 0.5391 1.7399 2.0052 0.3280 1.7378 0.9545 3.5470 0.7267 0.8290 1.5342 1.5242 2.7795 1.3289 10.0040 1.8290 2.5045 2.0515 1.2708 12.5867 31.4420 13.3885 3.4422 17.1120 15.8096 1.4498 0.8464 2.0633 4.0763 10.5206 4.8178 6.9537 5.9529 6.3263 10.5877 37.9747 14.6012 2.1180 1.2191 28.0382 46.6741 1.1959 40.7890 12.1081 106.8977 63.7994 9.5247 43.1719 12.5788 22.6750 33.3670 36.0148 9.1608 19.3030 81.7829 87.7165 11.6333 25.9515 11.9823 107.0091 7.9435 2.1026 0.1759 39.7559 152.6338 30.8328 105.1730 71.0499 188.6129 7.7029 1.5322 251.4097 9.2431 6.1839 29.4800 3.4642 17.0467 38.2676 22.0408 107.4748 51.1784 26.7061 11.7659 30.5491 7.2465 37.0380 33.2682 9.9400 34.5481 7.8363 22.2185 112.9566 41.2549 25.2262 5.4194 863.4581 20.1709 75.8917 86.6010 6.3557 54.7469 19.3009 174.8350 73.5132 61.4783 4.9210 33.8790 34.0007 6.0779 29.2890 1.1945 20.4081 0.2833 4.2813 9.9977 15.7042 42.1549 1.9283 1.3892 20.3497 172.2480
temp: 298.150 k
press: 1.00000 atm
elementType: 17 8 8 8 8 8 7 6 6 6 6 6 6 6 6 6 6 6 6 6 6 6 6 6 6 6 6 6 1 1 1 1 1 1 1 1 1 1 1 1 1 1 1 1 1 1
symmnumber: 1
zpe: 902677.6 jmol-1
zpe.correction: 0.343812 hartree
zpe.thermalcorrener: 0.370231 hartree
zpe.thermalcorrenthalpy: 0.371175 hartree
zpe.thermalcorrgfe: 0.285327 hartree
zpe.sumelectzpe: -1699.979891 hartree
zpe.sumelectthermal: -1699.953472 hartree
zpe.sumelectthermalent: -1699.952528 hartree
zpe.sumelectthermalfe: -1700.038376 hartree
dipole: 1.2769 5.2515 -0.7567
dipole: 5.4572
quadrupole: -157.4616 -149.0563 -173.9572
quadrupole: -17.3865 -14.4193 -11.5683
quadrupole: 2.6967 11.1021 -13.7988 -17.3865 -14.4193 -11.5683
hfenergy: -1700.3237029 hartree
pointgroup: C01 [X(C21H18Cl1N1O5)]
dipole: 0.4030759 -2.0874438 0.2997496 debye
polarizability: 490.0213648|18.4988825|292.0170261|-5.4250619|-8.7151939|131.0773507 unknown
InChI: InChI=1S/C21H18ClNO5/c1-12(24)28-18-9-14-7-5-4-6-13(14)8-15(18)21(25)23-17-11-19(26-2)16(22)10-20(17)27-3/h4-11,23H,1-3H3
charge 0 multiplicity 1
46 atoms
Cl -6.796226 0.64671 0.649265
O  1.153635 -1.860715 -0.078973
O  -2.281554 -2.067612 0.80737
O  -0.067203 2.233798 -0.279353
O  -4.783922 2.923356 -0.000728
O  2.215774 -3.093324 -1.787379
N  -0.777997 0.054612 0.202124
C  4.003223 1.311572 0.098503
C  4.459587 -0.062415 0.079749
C  1.643874 0.548391 -0.015775
C  2.601781 1.571858 0.050585
C  2.130117 -0.808059 -0.04475
C  3.48802 -1.109125 0.007069
C  0.201267 1.010001 -0.054802
C  4.971724 2.368093 0.167504
C  -2.174738 0.268064 0.26971
C  5.866453 -0.332463 0.129752
C  -2.987716 -0.863723 0.600847
C  6.336398 2.07733 0.21567
C  6.785943 0.716955 0.19673
C  -2.810872 1.512579 0.046237
C  -4.215393 1.643368 0.150385
C  -4.385864 -0.743857 0.707677
C  -4.988752 0.509223 0.478572
C  1.285613 -2.975557 -0.97535
C  -3.035639 -3.208274 1.336631
C  0.145106 -3.933893 -0.737221
C  -5.388506 3.182768 -1.324633
H  2.227568 2.601522 0.056526
H  3.821372 -2.14949 -0.025508
H  4.622545 3.406978 0.180521
H  6.211262 -1.372744 0.110083
H  -0.457153 -0.910498 0.360665
H  7.071131 2.887852 0.26713
H  7.859931 0.504321 0.2334
H  -2.207342 2.390772 -0.187646
H  -5.012932 -1.599308 0.967798
H  -3.517932 -2.949784 2.297896
H  -2.291141 -4.002012 1.496346
H  -3.799609 -3.552676 0.613495
H  0.334669 -4.501325 0.192906
H  0.078695 -4.639681 -1.57778
H  -0.801516 -3.38503 -0.606526
H  -6.217447 2.479343 -1.52861
H  -4.622821 3.106773 -2.12079
H  -5.775812 4.211227 -1.271824
