program: Gaussian 09
title: 000078476
version: EM64L-G09RevD.01
frameworkgroup: C1[X(C11H14O3)]
method: RPBEPBE
basis: SDD
operation: Freq
keyword: #pfreq=noraman
keyword: PBEPBE/SDD
title: #p freq=noraman PBEPBE/SDD
converged: YES YES NO NO
title: Mulliken charges:
elementType: O O O C C C C C C C C C C C H H H H H H H H H H H H H H
charge: -0.251073 -0.244626 -0.432936 0.030106 -0.073442 -0.601959 -0.354073 -0.359113 0.464151 -0.378741 -0.443103 -0.224727 -0.220453 -0.245729 0.216145 0.224679 0.239695 0.228382 0.257251 0.190726 0.187436 0.259233 0.266585 0.232551 0.356569 0.224187 0.224827 0.227453
chargesum: 0.00000
title: Mulliken charges with hydrogens summed into heavy atoms:
elementType: O O O C C C C C C C C C C C
charge: -0.251073 -0.244626 -0.076366 0.246252 0.151236 -0.133883 0.093905 0.087556 0.464151 -0.112155 -0.210553 -0.000540 0.004374 -0.018276
polarizability: 1.59598435e+02 1.80593019e+00 1.21855301e+02 9.67945463e+00 -1.42467815e+00 8.36567632e+01
1716.lowfreq: -14.9344 -11.3666 -5.7079 -0.0005 -0.0004 -0.0003 19.8485 39.2425 66.7668
frequency: 19.5511 39.0134 66.7579 105.2375 175.8911 195.6020 237.4027 267.2954 303.7803 370.9599 376.5059 405.7306 413.1055 448.5903 498.0792 529.3757 545.3597 590.6509 617.9755 706.2417 754.0769 765.9701 779.8589 788.2627 825.0307 856.9375 880.6555 901.9953 921.2971 932.3939 942.7896 968.1359 979.4450 990.6854 995.9722 1009.4093 1028.6034 1075.3531 1084.1562 1098.0163 1115.0732 1171.5139 1186.2506 1190.1176 1198.5674 1213.2114 1220.9902 1281.1303 1283.5392 1299.3663 1318.2918 1332.0849 1352.3242 1361.0887 1363.6115 1373.6515 1382.3730 1439.1056 1440.0927 1449.2840 1453.1903 1484.7069 1592.4900 1615.1179 2911.9653 2950.9182 2962.1364 3009.5993 3051.9946 3076.6951 3105.5474 3108.2356 3115.7127 3124.9142 3138.4595 3152.6144 3164.4246 3532.5958
redmass: 4.0273 4.4618 4.6520 5.2062 3.9510 4.9534 4.1919 5.0368 2.5714 1.9408 1.5812 2.8318 1.6898 2.6539 5.2555 6.1162 2.9536 5.1054 6.1595 1.8283 1.9710 2.9157 4.4725 4.0634 3.7603 1.2461 2.6856 2.3208 2.0868 2.3411 3.0062 2.3141 1.4002 5.4990 1.3741 3.5343 2.2100 1.8649 1.6276 3.0006 1.8048 1.0559 1.1077 1.1265 1.1074 2.1489 1.3859 1.6986 1.4755 1.4219 1.1863 1.2524 1.2627 1.3392 1.4421 1.2917 6.3920 1.2340 1.6195 1.0980 1.1579 2.3056 6.0628 6.0957 1.0841 1.0681 1.0680 1.0611 1.0863 1.1002 1.0951 1.0973 1.0863 1.0871 1.0928 1.0957 1.1006 1.0651
irintensity: 0.4412 1.0281 0.1756 1.5183 10.6826 5.2084 3.1088 8.6234 1.8660 7.3871 22.3027 0.1386 72.7681 8.5437 11.6679 16.0304 10.3235 6.6746 0.4949 51.6843 67.2865 24.2540 18.3168 20.0344 13.1510 0.4534 11.2126 24.8377 5.2311 32.6946 24.4159 20.3877 0.2812 0.1429 6.7185 155.8734 3.3793 19.6296 10.9693 88.8246 29.6911 0.4002 23.0872 0.7964 28.3495 5.1858 10.9579 0.5892 3.6966 1.7444 3.8078 2.0231 2.1402 33.0796 29.6599 27.8297 1.0068 5.0766 12.9965 15.0409 15.5765 22.1384 0.9042 8.1084 49.7953 23.1792 94.7584 16.3169 42.8565 9.0013 17.3769 17.4743 7.0463 1.3823 30.9449 28.5883 15.8983 7.2030
temp: 298.150 k
press: 1.00000 atm
elementType: 8 8 8 6 6 6 6 6 6 6 6 6 6 6 1 1 1 1 1 1 1 1 1 1 1 1 1 1
symmnumber: 1
zpe: 604204.7 jmol-1
zpe.correction: 0.230129 hartree
zpe.thermalcorrener: 0.242682 hartree
zpe.thermalcorrenthalpy: 0.243626 hartree
zpe.thermalcorrgfe: 0.189624 hartree
zpe.sumelectzpe: -652.154494 hartree
zpe.sumelectthermal: -652.141941 hartree
zpe.sumelectthermalent: -652.140997 hartree
zpe.sumelectthermalfe: -652.194999 hartree
dipole: 0.6738 -0.1302 2.6479
dipole: 2.7354
quadrupole: -86.1068 -80.0168 -81.7867
quadrupole: 0.7492 -6.5128 0.3756
quadrupole: -3.4700 2.6200 0.8501 0.7492 -6.5128 0.3756
hfenergy: -652.3846231 hartree
pointgroup: C01 [X(C11H14O3)]
dipole: 0.2635467 -0.1925229 1.0254981 debye
polarizability: 159.6738487|-0.5534139|121.5870025|9.6350549|3.2103711|83.8496476 unknown
InChI: InChI=1S/C11H14O3/c12-10-7-13-11(14-8-10)6-9-4-2-1-3-5-9/h1-5,10-12H,6-8H2
charge 0 multiplicity 1
28 atoms
O  -1.25921 0.961098 -0.061279
O  -2.1080 -1.283509 -0.281738
O  -4.166148 0.847021 -0.729363
C  -0.942257 -0.466631 0.076084
C  -3.601056 0.498886 0.577069
C  0.187298 -0.813338 -0.895324
C  -2.343532 1.342997 0.875384
C  -3.236054 -1.000558 0.638138
C  1.563349 -0.358902 -0.423251
C  1.871486 1.020431 -0.284088
C  2.56642 -1.313421 -0.116997
C  3.150991 1.43055 0.151248
C  3.848416 -0.905048 0.318852
C  4.144879 0.470118 0.454611
H  -0.676099 -0.670623 1.141165
H  -4.399454 0.728312 1.305111
H  -0.072123 -0.355278 -1.86816
H  0.169975 -1.909014 -1.030043
H  -2.534442 2.409847 0.685844
H  -2.003888 1.196518 1.923668
H  -2.958368 -1.297209 1.673272
H  -4.071083 -1.620666 0.279315
H  1.098937 1.762387 -0.511544
H  2.344059 -2.382557 -0.224363
H  -3.470014 0.644779 -1.408506
H  3.374857 2.498927 0.25148
H  4.612213 -1.656914 0.548216
H  5.138148 0.789997 0.7895
