program: Gaussian 09
title: 000078466
version: EM64L-G09RevD.01
frameworkgroup: C1[X(C12H18O)]
method: RPBEPBE
basis: SDD
operation: Freq
keyword: #pfreq=noraman
keyword: PBEPBE/SDD
title: #p freq=noraman PBEPBE/SDD
converged: YES YES NO NO
title: Mulliken charges:
elementType: O C C C C C C C C C C C C H H H H H H H H H H H H H H H H H H
charge: -0.280849 -0.223270 0.389521 0.163338 -0.699744 -0.697953 -0.382132 -0.542938 0.472187 -0.450085 -0.816344 -0.235892 -0.687760 0.253772 0.205991 0.209258 0.226663 0.227071 0.208904 0.207013 0.227460 0.243171 0.226861 0.220915 0.233133 0.223965 0.205244 0.205213 0.205916 0.230753 0.230620
chargesum: 0.00000
title: Mulliken charges with hydrogens summed into heavy atoms:
elementType: O C C C C C C C C C C C C
charge: -0.280849 0.030502 0.389521 0.163338 -0.057832 -0.054965 -0.154672 -0.299767 0.472187 -0.223224 -0.138331 0.174565 -0.020471
polarizability: 1.64804945e+02 -4.79097152e-01 1.52819274e+02 2.70582031e-01 -2.42560133e-01 8.85108849e+01
1716.lowfreq: -6.7027 -5.7231 0.0005 0.0007 0.0008 5.5947 29.1170 33.9816 64.3058
frequency: 27.4063 33.5035 64.2713 87.4018 112.1142 115.2946 183.0957 205.7649 217.6342 226.8020 241.2124 246.7021 268.8081 302.3417 345.8100 391.3387 409.8249 464.2169 489.8908 561.5876 580.0196 594.7763 690.3537 727.9033 749.1218 818.3691 827.1114 860.0090 861.7724 888.3582 920.6127 948.8141 953.1142 956.5531 1008.1189 1037.1202 1044.3107 1059.1791 1094.8839 1115.3373 1115.5051 1135.8417 1159.1413 1167.0832 1213.0344 1256.8470 1260.6261 1283.0259 1323.3709 1328.6159 1370.2168 1376.9163 1389.5897 1395.9013 1396.6345 1398.7324 1404.6499 1459.6506 1467.2029 1469.4218 1472.8475 1473.1690 1477.8576 1480.2372 1483.3381 1489.8552 1505.6078 1588.1628 1616.2798 2950.3053 2970.3209 2971.6363 2973.4816 2995.7074 3007.0301 3030.7005 3052.0237 3061.4629 3072.0735 3074.4025 3080.4136 3081.6821 3092.9692 3104.3801 3114.3244 3138.0113 3143.6944
redmass: 2.6441 1.0253 3.5652 3.1698 1.6339 3.2025 2.8795 1.7977 3.4629 1.3979 1.2912 1.0950 2.7972 2.7683 3.5359 3.3437 2.6350 3.7859 3.3420 3.4666 4.7830 3.3779 3.8530 4.3360 3.3507 1.2626 1.1883 1.5725 2.4745 2.5821 1.2010 1.4039 2.4826 1.3807 1.6909 2.7814 1.5570 1.6822 2.3993 2.2357 2.5974 1.4388 1.9827 1.4965 1.6147 4.8919 1.1423 1.5688 1.6544 1.3458 1.3216 1.1967 2.3646 1.2510 1.3824 1.3341 2.7181 1.0406 1.0460 1.0505 1.0597 1.0966 1.1025 1.0498 1.1113 1.1018 2.3261 6.2893 6.5640 1.0553 1.0349 1.0384 1.0353 1.0361 1.1072 1.0859 1.0953 1.0998 1.0982 1.1003 1.0986 1.0994 1.0989 1.1013 1.0866 1.0945 1.0921
irintensity: 0.2033 0.4437 0.8732 3.4781 1.6342 0.6167 0.3695 0.3558 0.4670 0.0138 0.8270 0.0612 0.4958 0.2772 3.6964 1.2166 0.0076 0.4823 4.7876 2.6148 4.5046 9.9742 0.0253 5.8487 0.6447 50.7987 0.5026 3.3183 3.9241 0.4525 2.5244 0.5601 32.0858 0.2711 11.6922 50.4726 19.2300 41.8328 57.4490 7.3673 4.1106 4.1665 60.1070 4.2837 10.3176 119.3370 0.0378 16.5078 17.5025 4.2352 2.1257 16.6497 1.6349 15.1006 8.2897 37.6202 30.9191 12.3657 0.0777 5.6255 17.4899 35.4925 10.2378 9.5128 1.2025 20.1364 44.8672 23.2256 36.6931 44.4780 34.6725 53.9611 32.9555 25.4330 36.5971 0.6266 24.7385 0.8680 98.2594 27.3716 38.5181 24.5623 30.3249 35.1779 15.1168 39.6912 3.9076
temp: 298.150 k
press: 1.00000 atm
elementType: 8 6 6 6 6 6 6 6 6 6 6 6 6 1 1 1 1 1 1 1 1 1 1 1 1 1 1 1 1 1 1
symmnumber: 1
zpe: 703433.2 jmol-1
zpe.correction: 0.267924 hartree
zpe.thermalcorrener: 0.282807 hartree
zpe.thermalcorrenthalpy: 0.283751 hartree
zpe.thermalcorrgfe: 0.225126 hartree
zpe.sumelectzpe: -542.292927 hartree
zpe.sumelectthermal: -542.278044 hartree
zpe.sumelectthermalent: -542.277100 hartree
zpe.sumelectthermalfe: -542.335725 hartree
dipole: -0.4368 1.7510 -0.0495
dipole: 1.8053
quadrupole: -75.7373 -69.6719 -83.3364
quadrupole: 0.4940 0.1523 -0.0604
quadrupole: 0.5112 6.5766 -7.0879 0.4940 0.1523 -0.0604
hfenergy: -542.5608509 hartree
pointgroup: C01 [X(C12H18O1)]
dipole: -0.0854727 -0.7048948 0.0171923 debye
polarizability: 164.4394106|1.9310533|153.1179424|-2.2784478|0.0940689|88.5777506 unknown
InChI: InChI=1S/C12H18O/c1-5-13-12-8-10(4)6-7-11(12)9(2)3/h6-9H,5H2,1-4H3
charge 0 multiplicity 1
31 atoms
O  1.349241 -1.166244 0.073626
C  1.584004 1.663429 0.087653
C  0.225505 0.956743 0.112335
C  0.124982 -0.465861 0.104695
C  1.779709 2.562322 1.337554
C  1.766969 2.484182 -1.217421
C  -0.984545 1.686632 0.133296
C  -1.135361 -1.112651 0.121729
C  -2.33643 -0.360228 0.148395
C  -2.24694 1.051803 0.14887
C  -3.683433 -1.062903 0.201785
C  1.310956 -2.638621 0.058173
C  2.760364 -3.117537 0.016434
H  2.364263 0.882324 0.106859
H  1.027232 3.372696 1.373212
H  2.781028 3.032609 1.322462
H  1.687256 1.974312 2.268516
H  1.662698 1.840204 -2.10921
H  2.768806 2.952999 -1.243227
H  1.013541 3.291024 -1.292565
H  -0.937977 2.782596 0.133338
H  -1.20007 -2.205881 0.114651
H  -3.163042 1.653906 0.161729
H  -3.669055 -2.01518 -0.358484
H  -3.96903 -1.300221 1.245435
H  -4.48342 -0.430549 -0.221675
H  0.79198 -3.006985 0.967614
H  0.747618 -2.986733 -0.832658
H  2.795713 -4.222222 0.000581
H  3.269113 -2.737554 -0.885992
H  3.313726 -2.761711 0.902292
