program: Gaussian 09
title: 000078461
version: EM64L-G09RevD.01
frameworkgroup: C1[X(C12H17NO)]
method: RPBEPBE
basis: SDD
operation: Freq
keyword: #p
keyword: freq=noraman
keyword: PBEPBE/SDD
title: #p freq=noraman PBEPBE/SDD
converged: YES YES NO NO
title: Mulliken charges:
elementType: O N C C C C C C C C C C C C H H H H H H H H H H H H H H H H H
charge: -0.446586 -0.088232 -0.042175 -0.441293 -0.414641 -0.370607 -0.376547 -0.477778 0.446967 -0.378317 -0.449053 -0.228789 -0.221225 -0.246467 0.177853 0.182623 0.225753 0.220915 0.210427 0.236759 0.177371 0.171533 0.215824 0.221702 0.191984 0.329778 0.266224 0.231177 0.224438 0.223737 0.226645
chargesum: 0.00000
title: Mulliken charges with hydrogens summed into heavy atoms:
elementType: O N C C C C C C C C C C C C
charge: -0.116808 -0.088232 0.135678 -0.032917 0.016701 0.043523 0.010810 -0.064092 0.446967 -0.112094 -0.217876 -0.004351 0.002512 -0.019822
polarizability: 1.70976365e+02 8.60419663e+00 1.23415788e+02 -1.08742270e+01 1.13932727e+01 1.06322111e+02
1716.lowfreq: -11.8816 -1.8848 -0.0009 -0.0005 -0.0002 14.1160 33.0246 48.1049 58.2815
frequency: 32.8905 48.0317 58.1672 122.7998 194.7954 224.5800 227.8085 260.1845 297.9462 311.5884 340.8976 350.5597 406.0833 423.6936 460.0929 473.5633 485.0541 590.6992 610.6616 619.8357 705.1056 738.0144 770.8626 807.4407 813.2823 836.2705 861.0467 910.6425 927.2660 961.8081 974.4814 983.2306 989.5918 997.1537 1005.0446 1020.4609 1026.3489 1040.8846 1074.6018 1093.3391 1110.2282 1130.5614 1134.9323 1152.4316 1169.6328 1178.9874 1194.1715 1210.5712 1237.6159 1258.6362 1272.7997 1278.6868 1307.3706 1311.5159 1318.6367 1333.6946 1347.4680 1362.3474 1377.7818 1391.7294 1399.0130 1440.4003 1449.8776 1458.3283 1464.3773 1469.4940 1479.4712 1483.1898 1594.3412 1614.6413 2818.1973 2825.1051 2845.9544 2916.9009 2981.1289 2985.4244 3006.9417 3028.4328 3045.7727 3054.8876 3074.8917 3110.6137 3122.3073 3135.1631 3146.5807 3161.1288 3552.7520
redmass: 3.9585 4.2997 3.4937 3.8446 3.3466 3.1336 2.2471 3.9766 1.6889 1.4273 2.7836 2.0823 2.8621 3.5169 2.3366 2.9673 3.3249 4.4923 3.2865 4.4292 2.2421 1.6441 2.8123 3.7371 1.4900 2.2423 1.2486 1.5300 1.6201 2.6219 1.4762 1.3757 5.8062 1.4451 1.9422 2.7091 2.1177 2.3201 1.6271 1.7283 2.2944 2.2031 2.2672 1.2956 1.0605 1.1130 1.1936 2.5238 1.2599 1.4631 1.2955 1.4376 1.3365 1.2730 1.3727 1.2936 1.4639 1.5116 2.3530 2.4116 1.6737 2.1003 1.0896 1.1106 1.1008 1.1034 1.2396 1.7917 6.1824 6.1503 1.0717 1.0709 1.0702 1.0834 1.0620 1.0859 1.0624 1.0847 1.0888 1.0992 1.1035 1.0872 1.0860 1.0913 1.0955 1.1014 1.0660
irintensity: 0.3984 0.4328 0.9439 0.1418 5.1094 7.7061 0.4196 2.8640 41.4019 103.5765 11.6372 5.8190 0.3022 0.6629 2.2041 12.3929 6.3620 2.9305 3.6003 1.1265 30.6441 55.6788 29.8758 2.9653 1.5184 0.7702 0.2156 9.6147 2.6847 21.6845 8.6387 0.2309 0.0470 3.8761 47.5139 48.6785 7.4928 57.2029 10.9237 3.1600 16.0213 10.0819 31.3169 7.8244 0.3959 2.2490 12.8821 5.5754 12.5249 10.6319 16.0330 12.5830 12.3709 10.4092 4.9961 6.7932 39.8089 4.0300 1.3185 4.9030 1.9367 12.3916 7.0928 6.0053 13.6952 5.7138 9.0735 11.0225 0.8237 6.9620 43.3781 78.6710 166.9895 74.8013 49.8243 16.0930 18.4837 56.2695 22.3383 31.3001 44.9814 9.6720 0.1958 19.1088 32.5094 27.6750 2.5555
temp: 298.150 k
press: 1.00000 atm
elementType: 8 7 6 6 6 6 6 6 6 6 6 6 6 6 1 1 1 1 1 1 1 1 1 1 1 1 1 1 1 1 1
symmnumber: 1
zpe: 698750.3 jmol-1
zpe.correction: 0.266140 hartree
zpe.thermalcorrener: 0.279036 hartree
zpe.thermalcorrenthalpy: 0.279980 hartree
zpe.thermalcorrgfe: 0.226040 hartree
zpe.sumelectzpe: -596.365597 hartree
zpe.sumelectthermal: -596.352701 hartree
zpe.sumelectthermalent: -596.351757 hartree
zpe.sumelectthermalfe: -596.405697 hartree
dipole: -0.6533 0.5219 1.9792
dipole: 2.1486
quadrupole: -89.3957 -79.3418 -83.1462
quadrupole: 1.5392 5.4410 -0.3930
quadrupole: -5.4345 4.6194 0.8150 1.5392 5.4410 -0.3930
hfenergy: -596.6317369 hartree
pointgroup: C01 [X(C12H17N1O1)]
dipole: -0.203285 0.4513315 -0.6852413 debye
polarizability: 170.0801586|-15.6515223|103.1259957|3.7537029|6.0938699|127.5081097 unknown
InChI: InChI=1S/C12H17NO/c14-12-6-8-13(9-7-12)10-11-4-2-1-3-5-11/h1-5,12,14H,6-10H2
charge 0 multiplicity 1
31 atoms
O  4.636196 0.638073 1.144455
N  0.814474 -0.573878 -0.294021
C  3.542627 0.384963 0.188041
C  2.309261 1.269573 0.458109
C  3.172492 -1.097313 0.327955
C  1.143682 0.862095 -0.467352
C  1.980034 -1.444777 -0.585762
C  -0.394862 -0.974765 -1.049487
C  -1.681981 -0.36998 -0.494031
C  -1.867705 -0.230617 0.904937
C  -2.731025 0.014069 -1.364758
C  -3.07971 0.277964 1.420962
C  -3.948333 0.518693 -0.85103
C  -4.126783 0.652063 0.544993
H  3.899226 0.577221 -0.85113
H  2.552681 2.339205 0.294258
H  2.004421 1.143017 1.513806
H  2.904458 -1.29207 1.382564
H  4.044699 -1.727041 0.074142
H  0.24584 1.459571 -0.230842
H  1.417454 1.08444 -1.534032
H  2.297496 -1.35516 -1.659378
H  1.680067 -2.496639 -0.422074
H  -0.462923 -2.080124 -0.987699
H  -0.313043 -0.724855 -2.139195
H  4.857936 1.604034 1.129224
H  -1.044212 -0.515794 1.569418
H  -2.595149 -0.080129 -2.449949
H  -3.210265 0.381902 2.504466
H  -4.751111 0.811743 -1.537425
H  -5.067943 1.045713 0.945536
