program: Gaussian 09
title: 000078439
version: EM64L-G09RevD.01
frameworkgroup: C1[X(C3H7Cl2OP)]
method: RPBEPBE
basis: SDD
operation: Freq
keyword: #p
keyword: freq=noraman
keyword: PBEPBE/SDD
title: #p freq=noraman PBEPBE/SDD
converged: YES YES NO NO
title: Mulliken charges:
elementType: Cl Cl P O C C C H H H H H H H
charge: -0.177323 -0.171106 0.778436 -0.512027 -0.684836 -0.303516 -0.661246 0.296097 0.293084 0.238753 0.232668 0.217133 0.235866 0.218017
chargesum: 0.00000
title: Mulliken charges with hydrogens summed into heavy atoms:
elementType: Cl Cl P O C C C
charge: -0.177323 -0.171106 0.778436 -0.512027 -0.095656 0.167906 0.009771
polarizability: 9.51173973e+01 -5.04736085e+00 8.42670869e+01 -6.40586989e+00 -1.63581021e+00 7.09653178e+01
1716.lowfreq: -10.6019 -7.2802 0.0020 0.0031 0.0035 6.7520 55.2447 68.1174 88.2880
frequency: 55.0675 68.1014 88.2797 128.7421 196.7408 206.2026 228.3525 243.3537 269.3501 312.3338 406.8254 462.4756 690.3665 749.9261 854.1985 900.2885 1030.9634 1042.3239 1084.7901 1094.8194 1220.4379 1260.6073 1294.6801 1338.6643 1394.2986 1409.9886 1475.3451 1475.8105 1485.9972 2984.8297 3005.6299 3022.6693 3056.6001 3086.0882 3088.8982 3107.0919
redmass: 2.6092 2.2468 6.3417 15.1628 4.3616 6.8980 1.1911 4.8680 5.1033 5.7433 10.0680 15.9962 4.9086 1.1034 1.2460 1.9838 3.5012 3.1245 1.7694 2.0677 1.3465 1.2347 1.0900 1.3509 1.1894 1.0846 1.0418 1.0412 1.0877 1.0356 1.0602 1.0587 1.1020 1.1020 1.0994 1.1043
irintensity: 0.2782 0.4975 0.7254 1.5806 2.7612 17.1463 0.4358 4.5558 1.2735 6.5001 93.0214 122.0352 9.0614 17.0432 1.4773 2.1906 32.1316 11.1639 33.4411 48.5768 1.6207 4.9727 0.4732 3.7671 7.9871 9.3092 13.5195 7.8020 15.8440 25.5509 8.6150 4.5319 0.0122 35.0517 26.2042 6.1724
temp: 298.150 k
press: 1.00000 atm
elementType: 17 17 15 8 6 6 6 1 1 1 1 1 1 1
symmnumber: 1
zpe: 262108.6 jmol-1
zpe.correction: 0.099832 hartree
zpe.thermalcorrener: 0.109801 hartree
zpe.thermalcorrenthalpy: 0.110745 hartree
zpe.thermalcorrgfe: 0.062910 hartree
zpe.sumelectzpe: -1454.526876 hartree
zpe.sumelectthermal: -1454.516907 hartree
zpe.sumelectthermalent: -1454.515963 hartree
zpe.sumelectthermalfe: -1454.563799 hartree
dipole: -4.6084 -1.3219 -1.9226
dipole: 5.1654
quadrupole: -62.0557 -66.1702 -70.6247
quadrupole: 1.5353 -0.6483 0.2800
quadrupole: 4.2279 0.1133 -4.3412 1.5353 -0.6483 0.2800
hfenergy: -1454.6267084 hartree
pointgroup: C01 [X(C3H7Cl2O1P1)]
dipole: 1.9093691 -0.4782794 0.5054151 debye
dipolederiv: -0.3256118 0.0279876 0.0162499 0.1246843 -0.7107921 -0.2494013 0.0412065 -0.3064689 -0.4128694 -0.6024776 -0.2200582 0.1421273 -0.3165611 -0.5477567 0.1737221 0.2167579 0.2177731 -0.3663528 1.3702517 0.2130823 -0.1862434 0.1940786 1.7720731 0.090552 -0.3274368 0.1147 1.3712912 -0.5895868 -0.0028496 0.0184841 0.0196544 -0.5175999 -0.0006522 0.0540933 -0.0222375 -0.6521053 0.1438677 -0.0916678 -0.017962 -0.1356272 -0.202786 0.0237184 0.1155371 0.0104499 -0.1368412 -0.1077709 0.0075373 0.0073058 0.308667 0.068886 -0.0040951 -0.2173897 0.0223345 0.1108573 -0.0730668 0.0044746 -0.0099962 -0.1846725 0.0769767 0.0409533 0.1216171 0.0234954 0.080965 -0.0026122 0.0640032 0.0210388 -0.0355601 -0.0196883 -0.0329984 -0.0374799 -0.0225766 0.0905813 0.0120249 0.0043462 -0.0060034 0.011928 0.0831218 0.0075647 0.0291564 0.0198451 -0.0357438 0.0624381 -0.0013598 -0.052106 -0.0134969 0.0876837 0.0041586 0.0005485 0.0247938 -0.1065905 0.0742309 0.0569009 0.0139092 0.0035922 -0.0800064 -0.0360767 0.0134397 -0.0667103 0.0680587 0.08143 0.0021053 -0.0184577 0.0737991 -0.1253441 -0.0726065 -0.0017629 -0.083037 0.0610688 -0.1296138 -0.07873 0.0518356 -0.0787727 0.0265515 0.0514931 0.039542 0.0534372 0.0822017 0.0864968 0.0142282 0.019818 0.0282869 0.0886809 0.0036679 -0.0478291 0.0142013 -0.154521 unknown
polarizability: 92.8823337|6.7269872|84.5540426|-8.0841454|2.0758268|72.9134256 unknown
InChI: InChI=1S/C3H7OP.2Cl/c1-2-3-5-4;;/h2-3H2,1H3;;
charge 0 multiplicity 1
14 atoms
Cl -1.273242 1.888802 0.965608
Cl -2.388001 -1.458768 0.817559
P  -0.997982 -0.012599 -0.241223
O  -1.26872 0.157565 -1.791981
C  0.702486 -0.602143 0.296544
C  1.834394 0.29489 -0.244697
C  3.206642 -0.253461 0.210072
H  0.782077 -1.638486 -0.081993
H  0.674914 -0.627022 1.398884
H  1.790448 0.333088 -1.348907
H  1.703491 1.328979 0.1250
H  3.378358 -1.277263 -0.1697
H  4.018333 0.389536 -0.173352
H  3.286103 -0.278119 1.312185
