program: Gaussian 09
title: 000078436
version: EM64L-G09RevD.01
frameworkgroup: C1[X(C8H8O4)]
method: RPBEPBE
basis: SDD
operation: Freq
keyword: #p
keyword: freq=noraman
keyword: PBEPBE/SDD
title: #p freq=noraman PBEPBE/SDD
converged: NO YES NO NO
title: Mulliken charges:
elementType: O O O O C C C C C C C C H H H H H H H H
charge: -0.421510 -0.410012 -0.425660 -0.343437 0.171360 0.054105 0.102997 0.183546 -0.311016 -0.364209 -0.851460 0.163379 0.272801 0.258026 0.230592 0.304403 0.229895 0.392767 0.373889 0.389544
chargesum: 0.00000
title: Mulliken charges with hydrogens summed into heavy atoms:
elementType: O O O O C C C C C C C C
charge: -0.028743 -0.036122 -0.036116 -0.343437 0.171360 0.054105 0.102997 0.183546 -0.038216 -0.106183 -0.086570 0.163379
polarizability: 1.56932680e+02 1.50532993e+00 1.12899298e+02 8.83653907e-03 8.10886154e-05 4.56894054e+01
1716.lowfreq: -12.5403 -9.2446 -8.4114 0.0008 0.0009 0.0011 90.7236 109.4827 122.2751
frequency: 90.7231 109.4794 122.2650 152.1706 206.0479 256.8474 295.2580 298.0278 351.2033 357.8178 386.9730 425.8734 490.5195 496.8183 566.3523 575.1511 577.5335 618.5924 657.5691 688.6805 722.4490 763.7087 821.9190 864.7614 874.8871 938.0018 966.1968 1041.6769 1063.5761 1078.1233 1135.2554 1170.3647 1195.3206 1244.4801 1309.1051 1325.3078 1391.5527 1398.2993 1417.9837 1446.5058 1462.7937 1480.3835 1491.1473 1579.4370 1603.5498 1647.6257 2958.6194 2962.3928 3028.2632 3112.5779 3167.8294 3188.9624 3534.8707 3563.7800
redmass: 5.1378 3.6925 1.2350 4.5359 5.7130 4.1505 3.2801 5.5683 9.0285 4.5075 1.1291 9.5643 7.3638 2.8427 4.2776 1.2890 4.9842 5.0348 5.3058 4.6278 6.0872 5.6039 1.5447 1.0856 3.6134 2.7455 1.3267 1.4586 2.2465 1.9649 1.5702 1.5219 1.9897 3.3111 2.0273 2.6627 2.4066 1.3622 4.6434 2.3342 2.7992 1.5151 1.0443 4.5190 7.1112 4.2736 1.0475 1.0634 1.0984 1.0930 1.0882 1.0980 1.0641 1.0653
irintensity: 1.7620 0.0998 0.0490 0.5825 3.0793 0.0665 0.6451 0.1336 9.2087 14.2042 152.8568 10.8971 7.0007 8.6854 13.9839 126.2688 42.8423 1.5011 21.2208 19.4698 2.5621 12.0268 37.1609 157.5214 18.8196 56.9742 0.1613 2.2690 239.1723 147.8564 349.3052 62.9404 10.8039 14.2835 3.0755 217.7842 136.6270 21.6265 51.2220 36.9656 153.3671 119.4361 18.1467 6.3186 146.8731 323.2497 174.1344 169.3427 22.9936 0.4261 0.0903 3.1334 75.0525 52.3842
temp: 298.150 k
press: 1.00000 atm
elementType: 8 8 8 8 6 6 6 6 6 6 6 6 1 1 1 1 1 1 1 1
symmnumber: 1
zpe: 386846.1 jmol-1
zpe.correction: 0.147342 hartree
zpe.thermalcorrener: 0.158264 hartree
zpe.thermalcorrenthalpy: 0.159209 hartree
zpe.thermalcorrgfe: 0.111127 hartree
zpe.sumelectzpe: -609.693314 hartree
zpe.sumelectthermal: -609.682391 hartree
zpe.sumelectthermalent: -609.681447 hartree
zpe.sumelectthermalfe: -609.729528 hartree
dipole: -0.8434 -0.4983 0.0058
dipole: 0.9796
quadrupole: -55.7579 -72.7224 -71.7098
quadrupole: -9.9753 0.0280 -0.0148
quadrupole: 10.9721 -5.9923 -4.9798 -9.9753 0.0280 -0.0148
hfenergy: -609.8406555 hartree
pointgroup: C01 [X(C8H8O4)]
dipole: 0.3385106 -0.1838562 0.0123392 debye
dipolederiv: -0.6263229 0.3349364 -0.0183659 0.2571757 -1.0602126 0.0331125 -0.0157187 0.0348058 -0.3914827 -1.5722294 0.2239525 -0.0341971 0.1203533 -0.1612 -0.0070804 -0.0304125 -0.0048764 -0.4057808 -0.9867186 -0.5133986 0.01049 -0.8202467 -0.7893232 -0.0019172 0.0241824 0.004756 -0.4178503 -1.0868721 0.2344908 -0.0250004 0.4031629 -0.9581202 0.0334133 -0.0314405 0.0302037 -0.3671669 -0.3807881 0.4763679 -0.0249172 0.4341841 -0.2009091 0.012234 -0.0231879 0.0129647 -0.1308211 0.7559128 -0.5047605 0.0344125 -0.0883068 0.8669767 -0.0334693 0.017449 -0.0429425 0.1102419 -1.2734016 -0.0696851 -0.0225188 0.2751267 -0.3361978 0.017026 -0.0365561 0.0096651 -0.0692906 1.5287663 -0.1729985 0.038046 -0.0037133 0.4379469 -0.0138752 0.0322885 -0.0173013 0.1007428 0.5466702 -0.0482754 0.0151527 -0.4460188 0.0900937 -0.0163193 0.0311239 -0.0083776 -0.0825588 -0.6765675 -0.0806375 -0.0069003 -0.3491405 -0.0617644 -0.0128466 0.0034161 -0.0068317 -0.2079718 -0.0413561 -0.0340004 -0.0013953 -0.0098274 -0.0970513 0.0075916 -0.0022357 0.0073962 0.1102011 2.3975363 0.1019319 0.0401475 0.1108677 1.2806914 -0.0413495 0.0395741 -0.0412623 0.2539321 0.0771745 -0.070422 0.0011305 -0.0471829 0.0272187 0.0041846 0.0002887 0.0037652 0.1578647 0.0590593 0.0573624 -0.0047183 0.0504467 -0.0249526 0.0089543 -0.0045313 0.00891 0.1773365 -0.0394909 -0.0662885 0.1132234 -0.0096113 0.0670641 -0.0424594 0.1196112 0.0094822 -0.0401091 0.1214457 0.1256635 -0.0046776 0.0167126 0.0261145 0.0040058 -0.0006688 0.0064651 0.1300984 -0.031388 -0.0737621 -0.1080087 -0.0192281 0.0689163 0.0339674 -0.1182736 -0.0205575 -0.0505948 0.5193628 0.0573991 0.0006162 -0.0150387 0.434509 -0.0032854 0.0036624 -0.0016572 0.3674189 0.4138778 -0.0783031 0.0043894 -0.0449974 0.1243884 0.0080618 0.0027215 0.0074846 0.3542717 0.2953295 0.1004273 -0.0069087 0.1852822 0.2658113 0.0100508 -0.0112926 0.0079079 0.4015186 unknown
polarizability: 156.9336819|0.1472743|112.7382797|2.3624173|-2.7107635|45.8494223 unknown
InChI: InChI=1S/C8H8O4/c1-4-6(9)3-2-5(7(4)10)8(11)12/h2-3,9-11H,1H3
charge 0 multiplicity 1
20 atoms
O  -0.519983 2.108378 -0.13962
O  3.290528 -0.885686 0.064168
O  -3.102058 -1.250232 -0.05449
O  -2.869167 1.051468 -0.146727
C  1.399888 0.675346 -0.039179
C  -0.010648 0.826421 -0.07564
C  -0.877779 -0.324183 -0.047295
C  1.913944 -0.644324 0.024233
C  -0.30548 -1.627636 0.016111
C  1.079522 -1.795793 0.051946
C  2.317364 1.881339 -0.067775
C  -2.315459 -0.10341 -0.086338
H  -0.974709 -2.491863 0.036651
H  1.5446 -2.783268 0.099965
H  2.982616 1.877711 -0.95478
H  1.716541 2.801825 -0.11357
H  2.949585 1.944991 0.8408
H  -1.541686 2.041274 -0.160579
H  3.801407 -0.037267 0.042017
H  -4.058926 -0.981492 -0.088497
