program: Gaussian 09
title: 000078462
version: EM64L-G09RevD.01
frameworkgroup: C1[X(C14H14O)]
method: RPBEPBE
basis: SDD
operation: Freq
keyword: #pfreq=noraman
keyword: PBEPBE/SDD
title: #p freq=noraman PBEPBE/SDD
converged: YES YES NO NO
title: Mulliken charges:
elementType: O C C C C C C C C C C C C C C H H H H H H H H H H H H H H
charge: -0.318728 0.210139 0.210132 0.301644 0.301835 -0.362451 -0.362333 -0.383477 -0.383528 -0.787125 -0.787053 -0.226629 -0.226723 -0.245460 -0.245533 0.269314 0.269309 0.232193 0.232173 0.239714 0.241545 0.215075 0.215045 0.239714 0.241486 0.228218 0.228171 0.226677 0.226656
chargesum: 0.00000
title: Mulliken charges with hydrogens summed into heavy atoms:
elementType: O C C C C C C C C C C C C C C
charge: -0.318728 0.210139 0.210132 0.301644 0.301835 -0.093137 -0.093024 -0.151285 -0.151355 -0.090790 -0.090808 0.001589 0.001448 -0.018783 -0.018877
polarizability: 2.13541109e+02 4.23703504e-02 1.47027913e+02 -4.18833392e+00 4.92382917e-03 9.84663919e+01
1716.lowfreq: -3.6563 -0.0011 -0.0010 -0.0008 6.3838 10.7335 31.0846 38.7868 75.7333
frequency: 30.9724 38.7844 75.7332 118.0734 123.3106 162.8990 174.0818 203.7899 239.3036 263.3813 289.0057 396.2923 419.4695 439.1782 440.6214 490.3079 529.4549 538.4115 542.7404 584.2646 616.9217 702.8697 712.5409 737.8745 755.6038 761.4768 771.1037 803.9162 855.4614 864.7564 866.3167 936.2556 943.5847 976.7033 979.3745 984.6936 985.7478 1041.9751 1043.4644 1046.1844 1046.8186 1101.9493 1112.5470 1165.6790 1170.4494 1173.6829 1183.8987 1223.4637 1233.2450 1278.3563 1284.6169 1374.8101 1383.7870 1402.5010 1402.5495 1426.1248 1428.4366 1460.2830 1460.3379 1474.4476 1477.5584 1477.8901 1485.2015 1588.0371 1600.6660 1604.2493 1612.9213 2983.7046 2983.9947 3062.7791 3063.0344 3091.4967 3091.7839 3123.6908 3123.8227 3135.6074 3136.1118 3152.9569 3154.6112 3167.3690 3168.3215
redmass: 4.5859 3.6639 3.9358 1.0541 1.0533 3.3055 3.2712 3.6244 3.4950 3.9856 3.9987 3.6949 3.5561 2.8956 3.0376 4.2639 3.8443 5.2085 4.1380 7.3365 6.0391 4.4656 3.0723 2.0866 1.3425 4.2853 1.8282 4.6954 1.4450 3.8748 1.3070 1.3640 1.3669 1.3123 1.3097 1.6012 1.6014 2.0429 2.0314 1.5230 1.5409 2.3406 1.8707 1.6902 1.0748 1.1939 2.6556 2.7270 2.9742 1.5083 1.4474 6.6829 6.6596 1.2626 1.2816 1.9948 1.9808 1.0519 1.0502 1.6313 1.3079 1.5970 2.1855 6.2046 6.3302 6.6848 7.1525 1.0367 1.0367 1.0967 1.0967 1.1003 1.1002 1.0866 1.0866 1.0890 1.0891 1.0939 1.0936 1.1005 1.1000
irintensity: 1.5665 0.1366 0.0918 0.7800 0.2777 0.6107 0.1044 0.1486 6.0349 2.9056 12.5366 0.7246 1.0418 14.8646 3.2946 0.7796 3.4300 0.1795 0.0013 0.2256 0.0219 1.1778 7.6440 6.8488 120.8480 11.7978 35.7820 0.3225 5.3347 29.0356 0.2175 1.4699 0.4715 0.2174 0.0074 3.8385 2.0313 10.5840 16.7786 11.7971 2.8323 0.0072 139.9438 3.1695 5.7388 1.0459 192.2733 2.4209 192.4199 7.0465 0.0491 0.0016 0.3003 8.6733 19.6831 51.1386 0.1953 14.8239 8.5759 20.2055 7.6181 200.6233 21.6108 60.9010 0.0810 21.4777 0.0331 13.1345 39.4360 27.5218 5.8213 47.4341 2.5415 10.1641 5.6412 9.2517 15.2751 54.6459 0.6479 17.4241 15.4079
temp: 298.150 k
press: 1.00000 atm
elementType: 8 6 6 6 6 6 6 6 6 6 6 6 6 6 6 1 1 1 1 1 1 1 1 1 1 1 1 1 1
symmnumber: 1
zpe: 619430.5 jmol-1
zpe.correction: 0.235929 hartree
zpe.thermalcorrener: 0.249639 hartree
zpe.thermalcorrenthalpy: 0.250584 hartree
zpe.thermalcorrgfe: 0.194621 hartree
zpe.sumelectzpe: -616.045513 hartree
zpe.sumelectthermal: -616.031803 hartree
zpe.sumelectthermalent: -616.030858 hartree
zpe.sumelectthermalfe: -616.086821 hartree
dipole: -0.0055 -0.3180 0.0033
dipole: 0.3181
quadrupole: -78.5948 -82.9628 -89.8446
quadrupole: 0.0148 -2.6215 0.0122
quadrupole: 5.2059 0.8380 -6.0439 0.0148 -2.6215 0.0122
hfenergy: -616.281442 hartree
pointgroup: C01 [X(C14H14O1)]
dipole: -0.0020789 0.0013728 0.1251247 debye
polarizability: 213.1284232|-8.0534646|98.8790487|-0.0599932|0.0061462|147.0279416 unknown
InChI: InChI=1S/C14H14O/c1-11-7-3-5-9-13(11)15-14-10-6-4-8-12(14)2/h3-10H,1-2H3
charge 0 multiplicity 1
29 atoms
O  -0.000812 -0.004703 -0.748904
C  -1.237848 -0.079573 -0.05379
C  1.235818 0.075107 -0.053517
C  -2.345298 0.531079 -0.702314
C  2.34541 -0.531411 -0.702354
C  -1.381455 -0.801452 1.152423
C  1.376849 0.796676 1.153179
C  -3.612069 0.402885 -0.082199
C  3.611641 -0.399396 -0.082034
C  -2.159201 1.275844 -2.008376
C  2.161817 -1.275964 -2.008879
C  -2.657994 -0.909606 1.746265
C  2.653037 0.908741 1.747126
C  -3.777441 -0.304686 1.131062
C  3.774557 0.307978 1.1317
H  -0.509898 -1.275634 1.614283
H  0.503759 1.267616 1.615424
H  -4.480513 0.869144 -0.56277
H  4.481679 -0.862449 -0.562821
H  -1.367769 2.042136 -1.922984
H  -1.8425 0.59011 -2.816107
H  -3.096196 1.768676 -2.318936
H  3.100763 -1.764506 -2.320329
H  1.373737 -2.045724 -1.923616
H  1.841672 -0.590996 -2.815901
H  -2.773881 -1.470008 2.6804
H  2.766945 1.468928 2.681637
H  -4.769423 -0.38512 1.588217
H  4.766216 0.391409 1.589015
