program: Gaussian 09
title: 000078448
version: EM64L-G09RevD.01
frameworkgroup: C1[X(C10H15NO)]
method: RPBEPBE
basis: SDD
operation: Freq
keyword: #p
keyword: freq=noraman
keyword: PBEPBE/SDD
title: #p freq=noraman PBEPBE/SDD
converged: YES YES NO NO
title: Mulliken charges:
elementType: O N C C C C C C C C C C H H H H H H H H H H H H H H H
charge: -0.451349 -0.300752 -0.346784 -0.386428 -0.480537 0.422575 -0.317718 -0.385182 -0.436484 -0.222967 -0.222574 -0.243828 0.204792 0.169777 0.204992 0.236417 0.222565 0.193653 0.251783 0.183660 0.186026 0.273065 0.230298 0.223815 0.223379 0.226186 0.341621
chargesum: 0.00000
title: Mulliken charges with hydrogens summed into heavy atoms:
elementType: O N C C C C C C C C C C
charge: -0.109728 -0.048969 0.027784 0.054981 -0.064319 0.422575 0.051967 -0.112117 -0.206187 0.000848 0.000805 -0.017642
polarizability: 1.60705343e+02 -4.32241343e+00 1.14092966e+02 9.80301291e+00 3.93360246e+00 7.22827427e+01
1716.lowfreq: -11.8031 -5.0243 -0.0006 -0.0004 0.0002 6.9570 24.8129 52.5479 57.4810
frequency: 24.6829 52.5458 57.2069 77.5440 123.2440 141.5194 154.5554 228.9760 248.7441 283.5842 311.1771 404.9631 435.9079 450.5577 499.9157 596.3931 616.4077 681.5077 707.0063 747.3355 789.2266 809.1649 858.5281 881.9635 915.1518 959.8327 979.3737 982.4085 989.5818 996.0825 1004.9276 1025.5380 1059.0444 1074.0737 1080.4156 1130.2046 1146.5529 1168.5850 1169.7253 1181.1235 1209.9231 1215.5723 1234.4886 1271.4333 1278.7249 1287.3708 1312.9113 1341.3723 1380.5625 1394.3426 1418.1758 1439.8944 1451.4227 1472.3928 1475.8729 1483.4731 1487.1720 1500.7202 1593.7589 1615.0691 2836.0986 2854.7391 2927.6930 2965.4775 2973.5589 2981.0863 2998.4996 3071.7314 3111.5810 3123.3588 3136.8000 3151.2134 3162.8109 3435.3039 3566.1278
redmass: 4.1757 4.8326 1.9901 3.3737 2.0759 2.6628 3.6710 3.9226 4.5269 1.0857 3.3628 2.8496 4.0175 3.3476 3.2080 4.7507 6.2501 1.3637 1.9085 1.5428 1.0784 3.8167 1.2487 1.1903 1.3364 3.2568 2.0252 1.7044 6.0638 1.5752 2.0251 2.1639 2.1273 2.5789 1.6705 1.5259 4.2774 1.1290 1.0581 1.1103 1.6907 1.5938 1.3607 1.1781 1.1349 1.2576 1.3656 1.3991 3.0289 1.9771 1.4660 2.1328 1.2161 1.0931 1.3034 1.4564 1.2067 1.0885 6.1690 6.1267 1.0717 1.0713 1.0546 1.0856 1.1054 1.0838 1.0653 1.1014 1.0870 1.0865 1.0922 1.0952 1.1008 1.0745 1.0664
irintensity: 0.2138 0.3666 10.8449 1.5675 4.3547 1.9300 1.4933 2.4028 5.6301 157.9970 4.3256 0.2074 2.2562 22.8605 7.7543 4.9033 0.9064 80.3213 48.7750 67.8448 3.2347 4.6815 0.0831 1.2914 3.9497 31.8118 24.9419 20.7093 1.3486 23.1283 25.3759 10.5991 1.5974 6.8021 6.3572 4.9854 39.7829 5.6935 0.4244 0.7360 13.0184 9.9590 22.8999 1.4495 2.1706 8.4087 12.5296 18.5867 6.0302 0.1577 12.5126 9.8411 35.5738 8.3827 21.0757 1.0263 4.6118 2.9268 0.6365 7.4161 92.1645 125.2557 78.2536 27.6538 51.9159 15.7818 59.9113 47.7338 9.7244 0.7253 29.2402 28.2918 21.5322 0.3237 2.3688
temp: 298.150 k
press: 1.00000 atm
elementType: 8 7 6 6 6 6 6 6 6 6 6 6 1 1 1 1 1 1 1 1 1 1 1 1 1 1 1
symmnumber: 1
zpe: 605346.4 jmol-1
zpe.correction: 0.230564 hartree
zpe.thermalcorrener: 0.243208 hartree
zpe.thermalcorrenthalpy: 0.244152 hartree
zpe.thermalcorrgfe: 0.189684 hartree
zpe.sumelectzpe: -519.086394 hartree
zpe.sumelectthermal: -519.073750 hartree
zpe.sumelectthermalent: -519.072806 hartree
zpe.sumelectthermalfe: -519.127274 hartree
dipole: 1.0830 -2.3229 0.3277
dipole: 2.5838
quadrupole: -60.0767 -71.0493 -75.2468
quadrupole: -8.7487 6.0679 1.6602
quadrupole: 8.7143 -2.2584 -6.4559 -8.7487 6.0679 1.6602
hfenergy: -519.3169579 hartree
pointgroup: C01 [X(C10H15N1O1)]
dipole: 0.4605145 -0.5202773 0.7420298 debye
polarizability: 160.162325|7.5109109|97.2392883|10.7300298|-20.4422635|89.6794384 unknown
InChI: InChI=1S/C10H15NO/c12-8-4-7-11-9-10-5-2-1-3-6-10/h1-3,5-6,11-12H,4,7-9H2
charge 0 multiplicity 1
27 atoms
O  5.670909 0.611054 -0.89024
N  0.933183 -0.069036 0.120885
C  2.29139 -0.145113 0.69579
C  3.346752 0.275861 -0.345167
C  -0.152742 -0.460348 1.043934
C  -1.533092 -0.252584 0.429119
C  4.772651 0.217998 0.209299
C  -1.790696 0.860694 -0.411286
C  -2.588639 -1.15546 0.710815
C  -3.079163 1.068232 -0.951845
C  -3.880585 -0.946588 0.175607
C  -4.130385 0.167457 -0.658432
H  2.330673 0.540293 1.567491
H  2.539484 -1.167779 1.0845
H  3.291499 -0.387869 -1.231116
H  3.130299 1.302136 -0.6922
H  -0.052471 0.17553 1.949066
H  -0.068288 -1.517833 1.401658
H  0.868428 -0.572387 -0.77509
H  5.007291 -0.811478 0.560212
H  4.875427 0.91293 1.071899
H  -0.966413 1.546305 -0.634922
H  -2.399184 -2.026984 1.350631
H  -3.264827 1.93229 -1.600499
H  -4.686586 -1.653785 0.403009
H  -5.129885 0.32934 -1.077899
H  6.607772 0.604122 -0.569419
