program: Gaussian 09
title: 000078458
version: EM64L-G09RevD.01
frameworkgroup: C1[X(C14H11NO3)]
method: RPBEPBE
basis: SDD
operation: Freq
keyword: #p
keyword: freq=noraman
keyword: PBEPBE/SDD
title: #p freq=noraman PBEPBE/SDD
converged: YES YES NO NO
title: Mulliken charges:
elementType: O O O N C C C C C C C C C C C C C C H H H H H H H H H H H
charge: -0.287901 -0.424932 -0.307519 -0.468713 0.103528 0.143736 0.122299 0.454974 -0.313049 -0.307141 -0.227352 -0.227289 -0.344833 -0.447455 -0.214873 -0.197385 0.147177 -0.255045 0.293711 0.375328 0.279239 0.241648 0.241912 0.310309 0.240698 0.224317 0.223954 0.226783 0.393876
chargesum: 0.00000
title: Mulliken charges with hydrogens summed into heavy atoms:
elementType: O O O N C C C C C C C C C C C C C C
charge: -0.287901 -0.031056 -0.307519 -0.093384 0.103528 0.143736 0.122299 0.454974 -0.019338 -0.027903 0.014296 0.014623 -0.034525 -0.206757 0.009444 0.026568 0.147177 -0.028263
polarizability: 2.95583885e+02 1.84169280e+01 1.86354793e+02 1.31315387e+00 -4.73161765e+00 6.90161131e+01
1716.lowfreq: -5.3316 -1.9070 -0.0007 -0.0005 0.0003 3.9486 26.2992 36.9823 63.4260
frequency: 26.2382 36.9771 63.4216 83.3942 104.9529 110.5864 190.5196 206.9748 246.0949 275.3977 291.0670 361.6905 393.1128 404.0000 408.9722 431.4604 454.0622 521.9944 538.6258 577.1759 602.7883 614.5343 616.4170 649.6975 674.9831 697.4046 703.3834 762.6842 770.2859 778.9032 794.9460 819.1192 845.1420 862.2579 915.1966 917.2313 938.7070 978.3305 984.3466 992.2428 1001.8654 1015.2063 1017.3242 1025.1070 1048.2017 1079.6341 1093.8747 1128.8026 1154.6800 1171.2701 1182.3446 1187.4413 1224.3515 1270.0390 1283.7090 1320.5672 1326.2216 1372.5905 1387.1995 1415.5515 1437.6764 1468.1662 1484.8174 1550.9204 1566.6039 1577.9259 1597.0679 1606.2759 1615.4300 1654.1017 3121.5073 3131.2241 3140.8557 3144.1341 3158.9943 3163.5108 3172.2883 3187.9000 3197.7675 3200.0283 3524.1453
redmass: 5.3570 6.3040 6.2024 5.5944 7.6081 4.5732 5.4366 6.6338 7.0344 4.8986 5.1714 7.5122 5.8684 8.0625 3.0023 4.1917 4.4239 3.0877 6.0829 6.0300 1.3273 6.3390 4.4874 5.8436 4.2424 1.9323 3.2957 5.7775 1.7063 4.2695 1.5495 5.8259 1.2862 4.6028 1.3762 1.3364 1.3071 1.3432 6.1799 1.3834 1.3054 1.3738 5.5045 2.2718 3.2127 2.0158 2.0036 1.8777 1.9102 1.0556 1.0705 1.1209 3.3434 1.8627 1.9773 1.6526 2.2219 10.1772 7.4696 1.9827 2.4046 2.4266 2.4497 5.5489 4.3983 5.7848 6.4488 5.9869 6.1422 1.7268 1.0863 1.0882 1.0869 1.0943 1.0920 1.1002 1.0955 1.0963 1.0856 1.0946 1.0641
irintensity: 1.3799 1.5645 0.7616 1.4046 1.4676 1.4015 0.2839 3.6040 2.1973 1.7894 4.7890 7.7191 1.8230 10.1497 0.4941 9.5513 3.8921 19.9296 0.8040 25.0703 96.2888 3.1729 54.6882 3.9891 1.3978 45.8595 92.7830 4.3723 61.3728 4.0734 49.1612 2.3048 9.9168 17.7822 7.2342 13.3195 114.0939 2.5929 0.4605 7.0949 4.4790 1.9114 206.0268 7.2832 14.4263 15.2672 69.6419 36.4128 100.8916 0.6459 4.9554 0.2159 18.1016 13.8783 11.3455 37.6492 77.9029 29.7959 30.0082 3.2690 34.5204 38.2717 92.6204 282.8324 63.7990 73.9791 341.5816 26.3184 4.0465 21.8003 5.9046 2.7099 5.3997 30.8313 9.6845 39.9939 12.3723 10.7067 466.4914 22.1166 64.6185
temp: 298.150 k
press: 1.00000 atm
elementType: 8 8 8 7 6 6 6 6 6 6 6 6 6 6 6 6 6 6 1 1 1 1 1 1 1 1 1 1 1
symmnumber: 1
zpe: 574522.4 jmol-1
zpe.correction: 0.218824 hartree
zpe.thermalcorrener: 0.233505 hartree
zpe.thermalcorrenthalpy: 0.234449 hartree
zpe.thermalcorrgfe: 0.175430 hartree
zpe.sumelectzpe: -819.290246 hartree
zpe.sumelectthermal: -819.275565 hartree
zpe.sumelectthermalent: -819.274621 hartree
zpe.sumelectthermalfe: -819.333641 hartree
dipole: -3.4535 2.7977 -0.6385
dipole: 4.4902
quadrupole: -83.0501 -93.0828 -109.5131
quadrupole: 1.6535 1.4863 1.9588
quadrupole: 12.1652 2.1326 -14.2978 1.6535 1.4863 1.9588
hfenergy: -819.5090704 hartree
pointgroup: C01 [X(C14H11N1O3)]
dipole: -1.3422377 -0.771606 0.850753 debye
polarizability: 295.3518538|-20.5025949|148.7491493|1.3196701|-54.6205208|106.8537878 unknown
InChI: InChI=1S/C14H11NO3/c16-13(15-10-6-2-1-3-7-10)11-8-4-5-9-12(11)14(17)18/h1-9,15,17H
charge 0 multiplicity 1
29 atoms
O  0.316492 1.682263 -1.39402
O  -2.682024 -2.552103 1.28399
O  -0.558564 -1.73429 1.530778
N  0.867112 0.103998 0.236998
C  -1.535115 0.73184 -0.160695
C  -2.29835 -0.315149 0.478541
C  -0.033591 0.854293 -0.487917
C  2.284553 0.088873 0.116777
C  -2.263392 1.843554 -0.668685
C  -3.72009 -0.199459 0.552402
C  -3.661185 1.956606 -0.559243
C  -4.401619 0.922022 0.053182
C  3.018767 0.897765 -0.794227
C  2.980992 -0.802621 0.982351
C  4.427351 0.803512 -0.822375
C  4.386025 -0.883363 0.940112
C  -1.737739 -1.539804 1.11523
C  5.121052 -0.079209 0.036193
H  -1.678576 2.611349 -1.183242
H  0.468274 -0.570666 0.919596
H  -4.278397 -1.013378 1.020285
H  -4.16731 2.841953 -0.95848
H  -5.491261 0.984042 0.137584
H  2.480831 1.576452 -1.457336
H  2.414605 -1.429133 1.682182
H  4.985922 1.429968 -1.527232
H  4.907523 -1.574252 1.611958
H  6.214105 -0.141673 0.003069
H  -2.246195 -3.31769 1.746924
