program: Gaussian 09
title: 000078441
version: EM64L-G09RevD.01
frameworkgroup: C1[X(C8H12N2O2S)]
method: RPBEPBE
basis: SDD
operation: Freq
keyword: #p
keyword: freq=noraman
keyword: PBEPBE/SDD
title: #p freq=noraman PBEPBE/SDD
converged: YES YES NO NO
title: Mulliken charges:
elementType: S O O N N C C C C C C C C H H H H H H H H H H H H
charge: 1.064553 -0.529729 -0.537856 -0.260750 -0.551857 0.370475 -0.605239 -0.593662 -0.387376 -0.325089 -0.196068 -0.208033 -0.242475 0.289008 0.274471 0.255307 0.212513 0.279196 0.222400 0.248162 0.226940 0.294220 0.231536 0.235061 0.234292
chargesum: 0.00000
title: Mulliken charges with hydrogens summed into heavy atoms:
elementType: S O O N N C C C C C C C C
charge: 1.064553 -0.529729 -0.537856 -0.260750 -0.262850 0.370475 0.137052 0.156096 -0.160437 -0.030869 0.035468 0.027027 -0.008183
polarizability: 2.10654052e+02 -1.80929742e+00 1.21441308e+02 -7.38862806e+00 -7.84243712e+00 1.18547176e+02
1716.lowfreq: -13.9855 -10.3819 -0.0010 -0.0010 0.0010 9.3898 28.7469 38.0747 63.1417
frequency: 28.2886 37.9282 63.0438 91.7641 97.2753 174.3720 192.7392 200.4759 219.6340 222.1473 232.8838 267.9156 300.3716 371.2965 379.1895 403.8686 410.3313 440.2215 477.6902 503.0845 557.6534 611.0367 688.7820 758.3239 779.2209 817.5101 824.0441 839.9375 857.3476 912.2988 967.7184 973.3291 982.8552 994.6074 1017.4834 1020.8843 1079.2460 1079.8886 1101.8209 1172.0613 1177.9110 1181.7103 1211.8216 1222.5843 1239.8232 1333.3598 1385.9211 1407.7143 1417.8372 1446.6233 1455.5657 1462.1752 1470.4034 1471.6725 1476.3355 1577.5182 1597.4740 2927.6360 2944.4804 3036.4133 3038.7837 3092.3908 3100.5941 3116.1843 3134.9130 3146.4025 3163.9305 3176.4788 3390.2228
redmass: 4.2403 4.0312 2.9691 4.5657 5.4853 5.6011 3.8398 3.8761 1.9938 1.6932 1.4792 3.2279 4.6525 4.7940 3.4408 2.8677 9.6198 2.7863 5.6358 3.5386 5.9221 6.0778 1.8828 1.5549 1.7593 4.7348 5.6946 1.3899 4.2736 1.4449 3.7801 1.7916 6.0028 1.3356 1.4074 2.1530 1.5149 1.2737 1.3558 1.0601 5.2837 1.1497 1.6641 1.3184 3.1252 1.2634 6.7335 1.1259 1.1369 2.2661 1.0463 1.0530 1.0562 2.1240 1.0591 5.8365 5.8606 1.0434 1.0388 1.0900 1.0964 1.0985 1.0977 1.0880 1.0871 1.0930 1.0971 1.0989 1.0758
irintensity: 1.1194 1.1559 0.7535 3.1125 1.4250 11.7458 2.7307 1.3426 2.4546 1.6942 6.0346 5.7424 8.8405 1.5151 9.2967 3.7854 60.8408 39.1531 98.0210 5.6675 1.5033 1.9641 32.7068 93.5303 21.5619 0.2608 129.5905 19.8845 38.7904 4.4362 46.4446 12.1450 0.2697 0.8931 0.7137 4.1580 11.4138 2.2873 23.0528 0.0358 10.1709 1.2514 16.1102 3.2441 10.2640 3.4593 0.8738 25.8675 0.7728 11.7995 24.7329 1.6388 17.9816 37.9331 37.1641 2.3888 2.3602 54.8175 43.4792 12.6032 19.6571 1.8929 1.4260 7.5509 0.4200 24.3371 21.0185 9.9304 17.7007
temp: 298.150 k
press: 1.00000 atm
elementType: 16 8 8 7 7 6 6 6 6 6 6 6 6 1 1 1 1 1 1 1 1 1 1 1 1
symmnumber: 1
zpe: 502165.1 jmol-1
zpe.correction: 0.191265 hartree
zpe.thermalcorrener: 0.205770 hartree
zpe.thermalcorrenthalpy: 0.206714 hartree
zpe.thermalcorrgfe: 0.148860 hartree
zpe.sumelectzpe: -968.871590 hartree
zpe.sumelectthermal: -968.857085 hartree
zpe.sumelectthermalent: -968.856140 hartree
zpe.sumelectthermalfe: -968.913995 hartree
dipole: -3.6201 5.9574 0.0941
dipole: 6.9717
quadrupole: -88.6283 -85.6430 -82.0994
quadrupole: 8.4912 -0.6235 -3.0924
quadrupole: -3.1714 -0.1861 3.3575 8.4912 -0.6235 -3.0924
hfenergy: -969.0628546 hartree
pointgroup: C01 [X(C8H12N2O2S1)]
dipole: -1.3135084 -2.4020812 -0.1677464 debye
dipolederiv: 1.5673049 0.1003055 -0.0861057 0.3890221 1.4763418 0.157131 -0.4151326 0.1447469 1.227109 -0.5369703 -0.0264253 -0.0387057 -0.0889845 -0.6351773 0.0403412 0.1511436 0.1239871 -0.5369952 -0.8609623 -0.1158886 -0.078198 -0.1344538 -0.529874 -0.0307989 -0.1736792 -0.1011736 -0.5628544 -0.5721621 -0.1624971 -0.0541181 -0.0166389 -0.3854673 0.0416862 0.1438044 0.0944723 -0.3730119 -0.1776797 -0.0127711 -0.0309754 -0.5131615 -0.4339475 -0.1956631 0.0293086 -0.2324282 -0.4410001 0.3963123 0.1077929 0.1552808 0.1282336 0.0771763 0.0339437 0.3005717 0.051123 0.00519 0.154715 0.0797654 -0.0473305 -0.00167 0.1545095 -0.0742679 0.1538555 -0.3497475 0.0045876 0.033709 0.2876148 0.1297913 0.1511154 -0.0344545 -0.0267191 -0.0454733 0.1085395 0.1490856 -0.202087 -0.0227515 0.0527825 0.1064313 -0.0894706 -0.0895599 0.0978699 -0.0653041 0.0116233 -0.0651348 0.0930777 -0.0090616 -0.0241696 -0.0444388 -0.0040949 -0.0841403 -0.0642622 -0.1268641 -0.0452745 0.0969821 0.0082852 0.1601296 0.0343322 -0.0780838 -0.1430821 -0.0923622 -0.0316043 -0.0448075 -0.0106648 0.1043684 -0.1302864 -0.0128214 -0.1024592 0.140732 -0.1207061 0.0478949 -0.0433561 0.0793393 0.0956417 0.0200609 -0.098436 -0.0173222 0.0604754 -0.0109417 -0.0771204 0.0047348 -0.0053914 0.0334639 0.1032242 0.1456669 0.1391614 -0.0295938 0.1010261 0.1708668 0.117521 -0.0447602 -0.036419 -0.0983786 0.1189304 -0.0755412 -0.0795453 0.0194368 0.0047641 0.0430918 0.0770112 0.0644632 0.1545644 -0.0565007 -0.0366143 0.0399608 -0.0093157 0.0837408 -0.0534154 -0.1693749 0.0712465 -0.0160739 -0.050097 0.0631884 -0.0422682 0.1160304 0.0486741 0.0983532 -0.0001143 -0.0674649 0.013892 0.0321593 0.1169715 -0.0427913 0.0388223 0.1187004 -0.034779 -0.164909 -0.0609525 -0.1057265 0.0087074 -0.0168288 0.065283 0.0422306 0.0022891 0.0596012 0.0173544 0.0244344 0.0836024 0.0235702 -0.141427 0.104974 -0.1259927 -0.0035507 0.0561438 0.0289299 -0.1146456 0.0228001 0.0622503 0.0719803 -0.0689044 0.0917767 0.0047926 0.0936288 -0.0903319 0.0135387 -0.0417856 0.0760656 0.0345517 0.010791 0.0363637 0.0987127 0.0330616 -0.0921116 0.0233061 -0.1354073 -0.0066209 0.0854901 0.0158892 0.0879614 0.0812205 0.0514016 0.017259 -0.0665133 0.0372005 0.0600967 0.1000771 -0.102405 0.1053454 0.0054022 -0.0729503 -0.0674404 -0.0861126 -0.06354 0.1074993 0.0048576 -0.0876436 0.0103716 0.0883475 unknown
polarizability: 210.1882074|5.5613946|122.5494051|8.6370634|-7.2534858|117.9049239 unknown
InChI: InChI=1S/C8H12N2O2S/c1-10(2)13(11,12)9-8-6-4-3-5-7-8/h3-7,9H,1-2H3
charge 0 multiplicity 1
25 atoms
S  1.890133 0.775382 0.253863
O  1.57425 1.792085 -0.962028
O  3.022208 1.045202 1.376215
N  2.420519 -0.836151 -0.602469
N  0.251156 0.735904 1.342184
C  -0.954423 0.285082 0.74775
C  2.697873 -1.913582 0.368377
C  1.577859 -1.186234 -1.766157
C  -1.658107 -0.843435 1.263232
C  -1.504623 1.020296 -0.342562
C  -2.908187 -1.205348 0.720487
C  -2.735736 0.623547 -0.899793
C  -3.447022 -0.482607 -0.370817
H  0.537585 0.228947 2.199541
H  3.231131 -1.48963 1.236037
H  3.377669 -2.633054 -0.124901
H  1.791644 -2.464385 0.704476
H  1.316819 -0.263282 -2.3093
H  0.65395 -1.74277 -1.502927
H  2.194896 -1.814083 -2.436584
H  -1.233373 -1.414383 2.099276
H  -0.959615 1.888756 -0.724248
H  -3.455765 -2.056998 1.139099
H  -3.153388 1.190433 -1.738996
H  -4.411852 -0.773191 -0.799854
