program: Gaussian 09
title: 000078403
version: EM64L-G09RevD.01
frameworkgroup: C1[X(C9H16N2)]
method: RPBEPBE
basis: SDD
operation: Freq
keyword: #pfreq=noraman
keyword: PBEPBE/SDD
title: #p freq=noraman PBEPBE/SDD
converged: YES YES NO NO
title: Mulliken charges:
elementType: N N C C C C C C C C C H H H H H H H H H H H H H H H H
charge: -0.072194 -0.020608 -0.358898 -0.368858 -0.397145 -0.389930 -0.398599 -0.315836 -0.391278 -0.419853 -0.154302 0.169784 0.208018 0.211139 0.168345 0.207388 0.193900 0.193048 0.206017 0.216012 0.189157 0.172940 0.201210 0.237573 0.224079 0.244618 0.244276
chargesum: 0.00000
title: Mulliken charges with hydrogens summed into heavy atoms:
elementType: N N C C C C C C C C C
charge: -0.072194 -0.020608 0.018903 0.010626 0.004142 0.009134 0.006570 0.058313 0.070374 0.069041 -0.154302
polarizability: 1.36499539e+02 -6.18448258e+00 9.70877160e+01 2.50115986e+00 -2.05465356e+00 8.42785646e+01
1716.lowfreq: -12.2402 -0.0009 -0.0008 -0.0008 6.1000 16.5510 28.5602 59.0054 62.9794
frequency: 27.0897 58.4679 62.9459 101.2667 145.7240 218.8754 235.0264 251.1424 301.1638 361.0632 371.3199 386.8930 448.3019 451.4019 544.5655 559.9658 743.0557 752.9573 803.8746 839.1158 853.9148 855.5930 909.2661 931.0300 957.7191 996.5178 1028.0737 1044.2049 1055.9983 1068.5212 1096.0899 1111.2492 1122.6516 1151.1238 1158.0853 1167.0247 1227.0381 1256.2641 1259.7521 1265.4381 1276.5128 1287.8495 1297.5935 1327.0230 1330.0474 1341.9174 1345.5453 1351.5323 1369.8736 1392.9513 1449.2675 1451.9421 1459.0112 1459.9043 1464.6513 1470.4205 1475.7712 1485.1479 2197.8320 2814.1169 2815.4167 2834.6408 2967.3088 2984.3655 2986.1498 2987.5583 2999.6552 3014.8998 3020.3929 3034.0168 3035.5427 3042.0265 3047.2761 3056.2943 3083.0830
redmass: 2.8134 2.4936 4.5129 3.2735 2.9722 2.7632 1.9594 4.2081 2.0914 2.8152 3.5313 2.0569 2.9089 2.9076 4.9999 1.8472 1.1204 3.6972 1.4782 1.4146 2.5852 1.4183 2.2553 4.7647 1.3018 2.5291 3.8945 2.2639 1.9364 2.2405 1.4394 2.1041 2.5270 1.2734 2.3905 1.2626 1.6008 1.2636 1.3038 1.1859 1.2220 1.1876 1.3904 1.3545 1.3092 1.4423 1.4603 1.4914 1.3880 1.4282 1.0830 1.0906 1.0800 1.0873 1.0921 1.0824 1.0933 1.0959 12.4319 1.0718 1.0704 1.0696 1.0627 1.0583 1.0619 1.0612 1.0855 1.0628 1.0860 1.0952 1.1001 1.0876 1.1031 1.1035 1.1044
irintensity: 3.3064 0.0278 3.1600 4.0836 1.1666 1.7019 1.3031 1.8520 2.9144 0.7647 0.8256 3.6328 0.4415 1.3147 9.0779 0.8982 6.5007 8.2325 0.1080 0.2980 5.7365 3.9399 2.8458 7.9064 3.0636 13.9387 3.1685 6.5219 9.6865 9.9692 1.3479 28.0420 5.2487 6.9918 24.6803 3.9997 11.4595 0.6707 6.4031 8.7712 1.8338 2.6525 16.2561 6.9413 3.1759 1.3045 8.8626 1.3113 6.7276 2.2869 6.6914 7.6281 2.6212 14.5357 10.0291 2.6103 1.9466 15.9947 18.8815 41.1062 48.5962 235.2358 38.2441 8.7338 30.4402 34.0782 10.3199 13.1034 80.8481 66.4441 1.8215 34.2258 14.2827 97.6312 37.3317
temp: 298.150 k
press: 1.00000 atm
elementType: 7 7 6 6 6 6 6 6 6 6 6 1 1 1 1 1 1 1 1 1 1 1 1 1 1 1 1
symmnumber: 1
zpe: 622879.4 jmol-1
zpe.correction: 0.237242 hartree
zpe.thermalcorrener: 0.248921 hartree
zpe.thermalcorrenthalpy: 0.249865 hartree
zpe.thermalcorrgfe: 0.198259 hartree
zpe.sumelectzpe: -461.152814 hartree
zpe.sumelectthermal: -461.141135 hartree
zpe.sumelectthermalent: -461.140191 hartree
zpe.sumelectthermalfe: -461.191796 hartree
dipole: 4.0458 -2.0609 1.8557
dipole: 4.9050
quadrupole: -94.1666 -66.5994 -68.6645
quadrupole: 9.5129 -5.7080 1.1301
quadrupole: -17.6898 9.8775 7.8123 9.5129 -5.7080 1.1301
hfenergy: -461.3900559 hartree
pointgroup: C01 [X(C9H16N2)]
dipole: -1.6119009 -0.7442413 -0.7562887 debye
polarizability: 136.855822|4.3137747|96.6411307|3.6758653|1.8847423|84.3688668 unknown
InChI: InChI=1S/C9H16N2/c10-6-2-5-9-11-7-3-1-4-8-11/h1-5,7-9H2
charge 0 multiplicity 1
27 atoms
N  -0.922811 -0.282095 0.063588
N  5.067833 0.517698 0.628689
C  -1.263264 0.999764 -0.607323
C  -2.038817 -1.257868 -0.053183
C  -2.532262 1.629141 0.004184
C  -3.328625 -0.703833 0.58373
C  -3.722422 0.644836 -0.061504
C  0.366478 -0.849565 -0.391707
C  1.585576 -0.085529 0.169257
C  2.911513 -0.775265 -0.258601
C  4.107608 -0.067109 0.227879
H  -1.424682 0.839554 -1.70804
H  -0.414977 1.699014 -0.499725
H  -1.737452 -2.192264 0.456713
H  -2.2432 -1.513649 -1.127823
H  -2.324776 1.889685 1.059917
H  -2.770357 2.567323 -0.533147
H  -4.142846 -1.445221 0.469428
H  -3.154572 -0.559096 1.66744
H  -4.608677 1.073537 0.443207
H  -4.003563 0.477088 -1.122142
H  0.435708 -0.888849 -1.512245
H  0.415465 -1.89762 -0.034454
H  1.511546 -0.053625 1.270619
H  1.594603 0.96002 -0.187832
H  2.938664 -1.81458 0.123629
H  2.966406 -0.839392 -1.363354
