program: Gaussian 09
title: 000078383
version: EM64L-G09RevD.01
frameworkgroup: C1[X(C3H8ClPS)]
method: RPBEPBE
basis: SDD
operation: Freq
keyword: #p
keyword: freq=noraman
keyword: PBEPBE/SDD
title: #p freq=noraman PBEPBE/SDD
converged: YES YES NO NO
title: Mulliken charges:
elementType: Cl S P C C C H H H H H H H H
charge: -0.219701 -0.211345 0.386903 -0.588885 -0.829048 -0.636349 0.293963 0.262152 0.296205 0.269294 0.265283 0.238999 0.220937 0.251592
chargesum: 0.00000
title: Mulliken charges with hydrogens summed into heavy atoms:
elementType: Cl S P C C C
charge: -0.219701 -0.211345 0.386903 -0.032770 0.001734 0.075179
polarizability: 9.28120579e+01 -1.32924985e+01 9.56578692e+01 -2.44145683e-02 -3.28377408e+00 6.76535862e+01
1716.lowfreq: -10.9747 -7.1904 -0.0028 -0.0015 0.0036 6.5718 59.3848 122.0481 142.3274
frequency: 59.3821 122.0253 142.3076 149.5956 181.5753 192.3911 212.5109 257.5558 287.4747 406.2247 512.0010 649.8939 697.6606 767.9352 943.2319 948.4380 994.8698 1046.3984 1056.1618 1240.2457 1269.0593 1336.8379 1396.0402 1422.7062 1428.6549 1439.8436 1473.0023 1479.8644 2989.1487 3014.5359 3027.8797 3080.3439 3090.6412 3108.3811 3136.2720 3145.9360
redmass: 2.3797 4.2784 4.8564 1.1982 1.6818 2.6369 3.8069 1.6178 5.6588 6.0939 7.4854 4.8893 3.5062 1.3804 1.2767 1.2729 1.7993 2.1271 1.3839 1.1905 1.2992 1.1556 1.1822 1.0543 1.0667 1.0497 1.0389 1.0483 1.0355 1.0311 1.0595 1.1007 1.0999 1.1035 1.1027 1.1018
irintensity: 1.7166 0.8229 3.0058 0.2691 0.6401 4.3988 5.5715 0.9758 16.4100 41.7990 41.5874 26.6701 10.0252 31.5299 30.2275 32.4606 5.0263 14.4569 24.5589 5.1743 2.5476 14.3754 17.1421 8.2902 4.0877 18.5804 18.4846 9.6470 21.9431 2.2327 3.7097 15.4450 8.6013 13.1019 2.4559 0.9993
temp: 298.150 k
press: 1.00000 atm
elementType: 17 16 15 6 6 6 1 1 1 1 1 1 1 1
symmnumber: 1
zpe: 279370.1 jmol-1
zpe.correction: 0.106406 hartree
zpe.thermalcorrener: 0.115783 hartree
zpe.thermalcorrenthalpy: 0.116727 hartree
zpe.thermalcorrgfe: 0.071204 hartree
zpe.sumelectzpe: -1317.988710 hartree
zpe.sumelectthermal: -1317.979333 hartree
zpe.sumelectthermalent: -1317.978389 hartree
zpe.sumelectthermalfe: -1318.023912 hartree
dipole: -2.7471 -3.4690 2.2558
dipole: 4.9668
quadrupole: -63.0510 -63.1481 -56.3747
quadrupole: 3.8874 2.1412 1.0447
quadrupole: -2.1931 -2.2902 4.4833 3.8874 2.1412 1.0447
hfenergy: -1318.0951163 hartree
pointgroup: C01 [X(C3H8Cl1P1S1)]
dipole: 1.5660177 -0.8944741 -0.7522878 debye
dipolederiv: -0.5874558 -0.3383112 0.1584561 -0.2696792 -0.6638435 0.1816769 0.1537736 0.2339864 -0.4451503 -0.3870634 0.0151902 -0.0281733 0.0063469 -0.6798786 0.02336 -0.0429815 0.0142428 -0.3842906 1.0706871 0.290944 -0.152744 0.1295065 1.5595864 -0.104022 -0.1129571 -0.2095772 0.9599831 -0.0173221 -0.0394111 0.0450407 -0.0019631 -0.1537523 0.0066411 0.1631802 -0.0352303 -0.144158 -0.2646615 0.0325851 0.0209168 0.0380698 -0.2243562 -0.0754904 -0.0656742 -0.018737 -0.2484157 -0.1242571 -0.0359135 0.0108453 0.1078886 0.0024755 0.0417983 -0.1569452 0.0261539 0.0491299 0.0362754 -0.017337 -0.003532 0.0103138 0.0815599 -0.0214354 0.0244177 -0.0220626 -0.0476028 -0.0116927 0.0198989 -0.0120024 -0.0095383 -0.0907368 -0.0012049 -0.0276982 0.0150141 0.0933445 0.0120623 0.0141805 -0.0522557 0.0177723 0.1022254 -0.0055664 -0.0728663 0.0138526 0.0800862 0.0419269 -0.0466107 0.0739872 -0.0443978 0.0600351 -0.00306 0.0875878 0.019036 0.024598 0.1214156 0.0313161 0.0031307 0.0422658 -0.0702168 -0.0108961 0.019796 -0.0197995 0.0428814 -0.1242453 0.0504662 -0.0884219 0.0238854 0.0955811 0.0477059 -0.0710273 0.0473117 0.0462729 0.0989344 -0.0193412 0.007431 -0.0056649 0.0712732 -0.0664804 0.0779664 -0.0557406 -0.1253179 0.1353962 0.0423439 0.0173215 -0.0448058 -0.0899523 -0.0130265 0.023428 -0.0084504 0.0986392 unknown
polarizability: 82.2174463|5.5364393|105.1627169|-3.5286745|-6.5460385|68.7433502 unknown
InChI: InChI=1S/C3H8PS.Cl/c1-3-4(2)5;/h3H2,1-2H3;
charge 0 multiplicity 1
14 atoms
Cl -1.924944 -1.23102 0.939566
S  -0.709601 2.149092 -0.102429
P  -0.367669 0.112961 -0.134151
C  1.172795 -0.475918 0.775169
C  -0.436125 -0.685569 -1.820745
C  2.46244 0.150872 0.209574
H  1.017268 -0.198564 1.831805
H  1.171399 -1.578223 0.710596
H  -1.436074 -0.503882 -2.24262
H  0.325464 -0.228291 -2.473007
H  -0.270628 -1.769812 -1.722194
H  3.327662 -0.194199 0.803355
H  2.640225 -0.13813 -0.841995
H  2.425086 1.252683 0.266275
