program: Gaussian 09
title: 000078374
version: EM64L-G09RevD.01
frameworkgroup: C1[X(C7H5NO2)]
method: RPBEPBE
basis: SDD
operation: Freq
keyword: #pfreq=noraman
keyword: PBEPBE/SDD
title: #p freq=noraman PBEPBE/SDD
converged: NO YES NO YES
title: Mulliken charges:
elementType: O O N C C C C C C C H H H H H
charge: -0.402431 -0.431640 -0.021053 0.334431 0.119742 0.306499 -0.512209 -0.328873 -0.318696 -0.215542 0.254270 0.229830 0.260460 0.364864 0.360347
chargesum: 0.00000
title: Mulliken charges with hydrogens summed into heavy atoms:
elementType: O O N C C C C C C C
charge: -0.037567 -0.071293 -0.021053 0.334431 0.119742 0.306499 -0.257939 -0.099043 -0.058235 -0.215542
polarizability: 1.24294020e+02 8.52057484e+00 1.03237175e+02 -3.19886889e-04 1.13958153e-03 3.48548686e+01
1716.lowfreq: -6.2342 -0.0010 -0.0009 -0.0008 4.6651 8.8651 121.9399 135.0822 154.5103
frequency: 121.9392 135.0800 154.5096 308.5439 336.9173 339.2633 349.5078 391.3246 395.3862 439.0155 486.0582 493.4978 586.4080 611.7614 703.1073 729.9523 765.8568 811.5878 866.1384 928.5202 934.1194 1072.2301 1130.3340 1154.2361 1175.2314 1247.1017 1271.6045 1310.8879 1395.8022 1419.7459 1509.3497 1606.9863 1621.2971 2181.0654 3129.9254 3140.4502 3179.4385 3585.7269 3588.6040
redmass: 5.8171 9.9769 7.1439 5.5758 1.9772 1.1348 1.8625 3.9759 5.0835 10.0626 3.2991 9.1324 5.2642 4.4960 7.7832 3.4655 6.3312 1.5006 1.5931 4.5427 1.3480 2.2202 1.6838 1.1868 1.4060 2.0897 2.3397 2.0730 7.1226 3.5466 2.9485 6.8947 6.5738 12.6275 1.0903 1.0928 1.0952 1.0663 1.0664
irintensity: 0.1860 2.6821 0.0222 21.1059 26.6651 218.8970 46.0979 6.5861 1.9443 1.4841 33.6413 5.5190 0.0563 7.7802 14.6005 0.0811 35.9118 45.9457 33.2351 3.5802 0.0202 98.1457 248.9402 104.3600 11.9695 19.2861 13.6058 7.9876 50.2991 136.4641 86.6203 0.8313 9.0086 30.7481 12.3618 3.7526 2.3430 72.3468 26.2204
temp: 298.150 k
press: 1.00000 atm
elementType: 8 8 7 6 6 6 6 6 6 6 1 1 1 1 1
symmnumber: 1
zpe: 272799.5 jmol-1
zpe.correction: 0.103904 hartree
zpe.thermalcorrener: 0.112631 hartree
zpe.thermalcorrenthalpy: 0.113575 hartree
zpe.thermalcorrgfe: 0.070498 hartree
zpe.sumelectzpe: -474.214114 hartree
zpe.sumelectthermal: -474.205387 hartree
zpe.sumelectthermalent: -474.204443 hartree
zpe.sumelectthermalfe: -474.247519 hartree
dipole: 3.8143 2.5807 0.0002
dipole: 4.6054
quadrupole: -72.8830 -42.0173 -59.9486
quadrupole: -13.1369 0.0010 0.0001
quadrupole: -14.6000 16.2656 -1.6656 -13.1369 0.0010 0.0001
hfenergy: -474.3180173 hartree
pointgroup: C01 [X(C7H5N1O2)]
dipole: -1.6204501 -0.8106158 0.0000912 debye
dipolederiv: -0.7429078 0.7799177 -0.0000129 0.5910138 -0.6636657 0.000009 -0.0000162 0.000019 -0.3935755 -0.9947833 0.6470799 0.0000238 0.7339634 -0.540061 0.0000502 -0.0000389 0.0000718 -0.4291331 -0.3710807 -0.1148911 0.0000471 -0.100322 -0.2866322 0.0000188 0.0000149 0.0000024 -0.2503811 -0.1035103 -0.2645398 0.0000073 0.2231087 0.1037499 -0.0000007 -0.0000022 0.0000019 0.1086103 0.6002169 -0.8029313 0.0000182 -0.5476615 0.5281035 -0.0000129 0.00003 -0.0000079 0.0441714 0.8145487 -0.7701394 0.0000031 -0.8577061 0.3281455 -0.0000185 0.0000329 -0.0000174 0.0703045 -0.0756185 0.3895405 -0.0000147 -0.1727167 -0.023813 -0.0000095 0.0000043 -0.0000003 -0.1901069 -0.1069421 0.3821841 -0.0000102 -0.0690438 0.0627241 -0.0000108 -0.000004 -0.0000185 -0.1742532 -0.0419639 -0.1129005 0.0000013 0.3552765 0.0711363 -0.0000091 0.0000002 -0.0000123 -0.1358424 0.3210253 0.2604794 -0.000047 0.1701146 0.0917247 -0.0000156 -0.0000399 -0.0000168 0.0388109 0.084421 0.0089618 0.0000039 0.0145523 -0.0576198 0.0000087 0.0000008 0.0000086 0.1806773 0.0767786 0.0243868 0. -0.0066109 -0.1063721 0.0000105 -0.0000016 0.0000124 0.1733657 -0.0213342 -0.0454706 0.0000055 -0.0455007 0.0896727 0.0000052 0.0000095 0.0000046 0.1708756 0.2684165 -0.2003963 0.000001 -0.1305101 0.2209256 0.0000022 0.0000041 -0.0000029 0.3923578 0.2927337 -0.1812812 -0.0000264 -0.1579574 0.1819815 -0.0000274 0.0000062 -0.0000444 0.3941187 unknown
polarizability: 126.1416692|5.5027923|101.3895255|0.0001683|-0.0011716|34.8548686 unknown
InChI: InChI=1S/C7H5NO2/c8-4-5-3-6(9)1-2-7(5)10/h1-3,9-10H
charge 0 multiplicity 1
15 atoms
O  1.662585 -1.920442 0.000037
O  -2.926538 1.346268 -0.000047
N  3.082945 1.352911 0.000012
C  0.681459 0.275485 -0.000039
C  0.504326 -1.137142 0.000016
C  -1.755844 0.571275 -0.00001
C  -0.459242 1.125202 -0.000052
C  -0.803364 -1.679149 0.000051
C  -1.927727 -0.833827 0.000035
C  1.998619 0.847597 -0.000086
H  -0.307394 2.21084 -0.000103
H  -0.945677 -2.766772 0.000098
H  -2.941667 -1.242854 0.000069
H  1.446043 -2.885742 0.000047
H  -2.719825 2.313452 0.000072
