program: Gaussian 09
title: 000078442
version: EM64L-G09RevD.01
frameworkgroup: C1[X(C19H17NO2)]
method: RPBEPBE
basis: SDD
operation: Freq
keyword: #p
keyword: freq=noraman
keyword: PBEPBE/SDD
title: #p freq=noraman PBEPBE/SDD
converged: YES YES NO NO
title: Mulliken charges:
elementType: O O N C C C C C C C C C C C C C C C C C C C H H H H H H H H H H H H H H H H H
charge: -0.327977 -0.269347 -0.471283 0.375888 0.384135 0.285372 -0.549032 -0.421142 -0.380955 0.306923 0.105238 -0.424219 -0.406636 0.187953 -0.242884 -0.238106 -0.327195 -0.328099 -0.235268 -0.250935 -0.232789 -0.687397 0.228081 0.239933 0.276018 0.237246 0.241276 0.356778 0.229809 0.229991 0.311469 0.242803 0.227413 0.224740 0.214387 0.212960 0.214876 0.226844 0.233130
chargesum: 0.00000
title: Mulliken charges with hydrogens summed into heavy atoms:
elementType: O O N C C C C C C C C C C C C C C C C C C C
charge: -0.327977 -0.269347 -0.114505 0.375888 0.384135 0.285372 -0.320951 -0.181209 -0.104936 0.306923 0.105238 -0.186973 -0.165360 0.187953 -0.013074 -0.008115 -0.015726 -0.085296 -0.007855 -0.026195 0.194558 -0.012547
polarizability: 3.72287310e+02 -3.06295899e+01 2.52361186e+02 -8.51001400e+00 -1.37346548e+01 1.01285274e+02
1716.lowfreq: -5.4303 -3.0166 -0.0002 0.0004 0.0006 4.5266 20.7028 35.4933 41.0109
frequency: 20.5756 35.3792 41.0109 64.9244 89.5375 93.3642 114.9096 125.4654 181.9277 185.7378 197.3488 221.7063 243.9253 253.8909 292.5585 311.7072 327.6878 357.3435 390.7199 428.9791 456.7394 475.3069 477.7972 497.6247 511.6024 558.7115 572.4826 589.9296 601.7879 631.6344 637.0758 709.6043 721.4527 740.8344 753.4031 753.7272 761.5303 767.4687 789.7780 802.6027 828.9275 839.4402 844.1418 858.2854 880.5589 892.0250 910.6011 915.5378 938.5329 947.5002 964.7768 985.9597 990.7907 998.5849 1023.0550 1039.7515 1040.9629 1076.1270 1110.2871 1117.3500 1129.2160 1139.9634 1155.9796 1173.2072 1173.4096 1190.6545 1216.9874 1241.4630 1256.1107 1265.2057 1271.9919 1281.4634 1304.2868 1347.6537 1369.8636 1393.7431 1403.7195 1410.5471 1424.0658 1432.7875 1439.0671 1459.6608 1464.1924 1472.9949 1481.6905 1494.7042 1510.8582 1518.2370 1570.5084 1593.4186 1603.5635 1605.7329 1610.6820 1637.8691 2963.5648 2996.9453 3022.0557 3094.7025 3104.1683 3110.4135 3120.0897 3125.7571 3130.4369 3135.9408 3143.5198 3154.6925 3162.9028 3166.5133 3171.0659 3195.2594 3505.6971
redmass: 4.3327 4.9269 4.8349 4.4035 3.8096 5.9954 2.4387 2.8474 4.6628 3.8649 5.2207 4.8651 1.3441 3.6130 6.9169 4.4605 3.9681 5.8833 3.1244 4.7885 3.3246 3.2250 3.4617 4.1047 6.7927 3.7558 5.9068 6.3124 6.7871 3.9571 6.7237 1.4405 2.3317 2.8699 4.2619 1.3119 2.9084 1.9943 2.5474 5.6050 1.1122 4.5712 1.3305 1.3421 1.6632 5.6354 3.0942 1.8562 1.3460 4.5763 1.4027 1.2981 1.3389 1.3750 2.2934 2.8533 2.1627 3.1462 2.1180 2.0515 1.7325 1.4403 1.2129 1.0702 1.0731 2.4100 1.7761 1.8741 1.8482 1.1361 2.4245 1.8391 1.8240 1.7756 1.3972 3.3604 1.4619 4.9816 2.9502 4.4767 2.5030 2.4008 1.0399 1.8978 1.1586 1.1784 3.5971 2.4563 6.5857 7.1521 6.1691 5.5210 5.5139 6.6363 1.0558 1.0363 1.1077 1.0989 1.1015 1.0909 1.0862 1.0889 1.0890 1.0858 1.0947 1.0918 1.1003 1.0955 1.0970 1.0954 1.0757
irintensity: 0.0389 1.2173 0.4295 0.2720 1.2435 2.7527 3.4509 0.8772 3.5795 1.4385 3.2617 1.3853 2.5320 1.2524 2.5413 1.7988 1.9875 10.5505 0.2235 5.4213 6.3227 15.1734 8.1796 5.1156 0.5021 1.2089 19.1739 3.1724 1.4678 0.1911 1.4126 21.3281 2.1319 3.1724 9.1013 106.9371 3.7769 99.8422 12.7229 11.9206 0.7234 7.7238 20.2975 2.9610 37.5009 19.1236 24.7779 10.5751 7.1969 0.4001 8.6249 3.9391 0.4510 1.1752 4.8622 53.0609 36.4738 20.2457 29.1983 26.9771 46.9634 4.6831 9.0429 2.6008 2.3843 66.8162 53.9018 4.8573 130.3975 0.0161 14.5911 18.2458 72.6272 0.8341 43.4190 28.0312 34.0927 7.6109 20.8551 22.2215 143.9893 5.9379 13.2342 66.8381 0.2820 15.0628 114.4770 495.0440 55.3365 45.3720 7.7354 32.3978 45.7408 4.3242 48.2568 16.9503 29.6611 33.8540 34.6834 14.3932 6.2904 0.1990 9.2735 1.2902 31.3310 27.2112 37.8304 8.2638 20.9568 8.2360 40.1360
temp: 298.150 k
press: 1.00000 atm
elementType: 8 8 7 6 6 6 6 6 6 6 6 6 6 6 6 6 6 6 6 6 6 6 1 1 1 1 1 1 1 1 1 1 1 1 1 1 1 1 1
symmnumber: 1
zpe: 815507.5 jmol-1
zpe.correction: 0.310610 hartree
zpe.thermalcorrener: 0.329393 hartree
zpe.thermalcorrenthalpy: 0.330337 hartree
zpe.thermalcorrgfe: 0.262046 hartree
zpe.sumelectzpe: -937.910534 hartree
zpe.sumelectthermal: -937.891752 hartree
zpe.sumelectthermalent: -937.890808 hartree
zpe.sumelectthermalfe: -937.959099 hartree
dipole: -0.1254 5.5063 0.4313
dipole: 5.5246
quadrupole: -102.8149 -119.6733 -134.6462
quadrupole: 9.4222 -1.3373 -2.9146
quadrupole: 16.2299 -0.6285 -15.6014 9.4222 -1.3373 -2.9146
hfenergy: -938.2211447 hartree
pointgroup: C01 [X(C19H17N1O2)]
dipole: -0.098507 -2.1704318 -0.0619213 debye
polarizability: 373.3631409|28.5296308|249.2252891|10.9963633|-20.9514071|103.3453399 unknown
InChI: InChI=1S/C19H17NO2/c1-2-22-18-10-6-5-9-17(18)20-19(21)16-12-11-14-7-3-4-8-15(14)13-16/h3-13,20H,2H2,1H3
charge 0 multiplicity 1
39 atoms
O  2.451414 -1.762609 -0.023718
O  0.667229 2.833107 -0.031079
N  1.227069 0.554256 -0.017183
C  -3.01454 -0.352293 0.251987
C  -3.938104 0.646994 -0.247516
C  -1.13362 1.208361 -0.099938
C  -1.617631 -0.041468 0.314121
C  -3.420056 1.924032 -0.648989
C  -2.058327 2.200748 -0.572242
C  2.637104 0.611812 0.103135
C  0.31965 1.608973 -0.041955
C  -3.527551 -1.62436 0.673841
C  -5.334608 0.331604 -0.313367
C  3.312402 -0.650244 0.101951
C  -4.893805 -1.903576 0.598298
C  -5.80487 -0.917685 0.099506
C  3.396773 1.800045 0.223148
C  4.713404 -0.720611 0.220317
C  4.803808 1.724122 0.343637
C  5.461265 0.476115 0.342289
C  3.05425 -3.108607 -0.056297
C  1.912779 -4.108681 -0.21671
H  -0.945086 -0.802152 0.732172
H  -4.117031 2.685942 -1.017376
H  -1.651516 3.175848 -0.85714
H  -2.828908 -2.37818 1.056927
H  -6.031547 1.088855 -0.691836
H  0.867913 -0.398755 -0.125842
H  -5.276146 -2.877999 0.921206
H  -6.874362 -1.148941 0.045962
H  2.873128 2.757395 0.215904
H  5.228106 -1.685716 0.220309
H  5.382456 2.649072 0.436194
H  6.551303 0.423481 0.43381
H  3.76465 -3.166476 -0.905774
H  3.612474 -3.279428 0.886534
H  2.315513 -5.137097 -0.250889
H  1.209066 -4.04033 0.63078
H  1.356853 -3.921854 -1.151377
