program: Gaussian 09
title: 000078415
version: EM64L-G09RevD.01
frameworkgroup: C1[X(C14H20O3)]
method: RPBEPBE
basis: SDD
operation: Freq
keyword: #pfreq=noraman
keyword: PBEPBE/SDD
title: #p freq=noraman PBEPBE/SDD
converged: YES YES NO NO
title: Mulliken charges:
elementType: O O O C C C C C C C C C C C C C C H H H H H H H H H H H H H H H H H H H H
charge: -0.187607 -0.378952 -0.435111 -0.385614 -0.361799 -0.398723 -0.356540 -0.541536 -0.355853 0.122267 -0.697395 0.272857 0.135645 -0.496842 0.271617 -0.366699 -0.332038 0.235460 0.176835 0.195502 0.178224 0.225733 0.191592 0.192317 0.183493 0.227218 0.228906 0.192405 0.196596 0.208315 0.210983 0.213906 0.246836 0.221388 0.258067 0.353889 0.354657
chargesum: 0.00000
title: Mulliken charges with hydrogens summed into heavy atoms:
elementType: O O O C C C C C C C C C C C C C C
charge: -0.187607 -0.025064 -0.080454 0.026681 0.011927 0.018602 0.019271 -0.085412 0.033149 0.122267 -0.064191 0.272857 0.135645 -0.250006 0.271617 -0.145311 -0.073971
polarizability: 2.15969690e+02 -2.60111975e+00 1.69374706e+02 -2.49155577e+01 1.24968428e+00 1.12368051e+02
1716.lowfreq: -14.3296 -0.0009 -0.0007 -0.0005 4.6025 7.9104 14.8391 22.2013 25.0226
frequency: 14.3953 22.0504 24.5734 45.3813 78.3915 101.4655 108.9301 116.3561 136.9390 145.4026 160.2789 227.9554 232.3344 243.3636 288.6455 314.9331 319.0248 350.9071 369.4776 370.9571 389.4886 406.2094 423.2388 453.7781 473.7568 505.8131 526.8003 602.7372 646.9353 694.9558 720.4461 723.2216 741.7872 759.7108 794.9927 806.4214 840.2727 864.8202 874.5811 892.7995 904.4224 930.8318 968.2659 981.8237 1003.1294 1026.1727 1056.1307 1077.0464 1081.2042 1090.8276 1110.8561 1120.6456 1135.9358 1158.6748 1186.6875 1195.6252 1202.4683 1241.0467 1246.9109 1250.1171 1262.1237 1282.4302 1289.0675 1293.0093 1300.1722 1306.2269 1332.4943 1335.9284 1353.1064 1361.6263 1388.0067 1399.8682 1409.4267 1437.6987 1448.6017 1462.2323 1464.3829 1472.1028 1477.1692 1480.7712 1487.3207 1503.0192 1580.2095 1607.9578 1625.5184 2949.2857 2953.0483 2954.3287 2958.6879 2966.4011 2970.4631 2981.6806 2988.5252 3004.2296 3012.3763 3024.4161 3035.3729 3055.7313 3067.1075 3069.2306 3117.4431 3140.7676 3176.9457 3542.8882 3586.5417
redmass: 3.8508 5.2903 1.8763 3.6727 3.6896 3.6936 1.9790 3.1306 3.7986 2.4475 5.9159 2.2195 1.2689 2.4705 4.2300 4.8050 1.1356 5.7861 2.3952 2.1314 2.6222 2.5307 3.6033 6.0246 3.9379 2.9921 3.1288 3.1601 3.2797 3.3569 2.7373 1.1450 1.2819 4.3741 1.4260 1.5151 1.6296 2.6615 1.9765 1.9776 1.7692 1.3478 3.6006 1.3766 3.1968 2.3904 2.6993 2.0116 1.9893 1.7400 1.9975 1.9055 1.5556 1.1826 1.5500 1.5437 1.6369 1.3792 1.7562 1.8945 1.9620 1.1441 1.1519 1.2505 1.1627 1.6858 1.5129 1.4156 1.6472 1.5567 1.2174 5.9465 3.1477 1.1239 1.0836 1.0661 1.0762 1.0766 1.0426 1.0808 1.0866 2.7884 7.1960 7.2212 6.8682 1.0591 1.0600 1.0608 1.0640 1.0596 1.0365 1.0637 1.0948 1.0984 1.0975 1.0985 1.1011 1.1026 1.1007 1.0993 1.0901 1.0901 1.0952 1.0657 1.0662
irintensity: 0.8211 0.3258 0.0567 2.2162 0.6235 1.2013 0.1202 0.1593 0.9109 0.3781 0.7149 0.9045 0.1143 0.4590 2.9104 14.0080 140.6475 1.7509 45.6494 62.9916 49.4419 0.7224 2.0120 0.6348 4.8699 23.5213 2.4117 8.0129 2.5561 17.5149 1.0206 10.4740 7.0208 26.7757 8.6456 39.7768 36.3362 20.7244 3.4455 14.9073 0.5248 0.2695 28.8101 5.2530 6.1640 3.7180 1.9874 2.2251 0.4134 162.9172 30.5058 65.8704 117.0442 69.3926 19.9629 96.8289 88.5958 5.2062 9.4353 4.7957 28.1224 8.2522 6.3414 1.1594 14.2909 25.2003 32.3124 2.9202 1.2134 0.7644 11.1825 69.9632 64.3059 43.4846 15.1546 0.7252 0.7202 0.9353 12.1206 3.6495 21.0062 41.9340 168.8240 25.5052 2.6223 4.9969 6.6539 30.8734 32.2290 104.4776 37.1041 42.1960 9.9926 2.8826 18.2471 20.8432 36.4156 63.7973 100.5886 59.4701 17.0049 8.0181 4.4111 27.3267 35.3279
temp: 298.150 k
press: 1.00000 atm
elementType: 8 8 8 6 6 6 6 6 6 6 6 6 6 6 6 6 6 1 1 1 1 1 1 1 1 1 1 1 1 1 1 1 1 1 1 1 1
symmnumber: 1
zpe: 811662.0 jmol-1
zpe.correction: 0.309146 hartree
zpe.thermalcorrener: 0.327969 hartree
zpe.thermalcorrenthalpy: 0.328914 hartree
zpe.thermalcorrgfe: 0.259096 hartree
zpe.sumelectzpe: -769.837523 hartree
zpe.sumelectthermal: -769.818700 hartree
zpe.sumelectthermalent: -769.817755 hartree
zpe.sumelectthermalfe: -769.887573 hartree
dipole: 2.1043 -1.5410 -1.5369
dipole: 3.0274
quadrupole: -100.9051 -86.8085 -109.1019
quadrupole: 7.4515 -0.7056 -4.9228
quadrupole: -1.9666 12.1300 -10.1634 7.4515 -0.7056 -4.9228
hfenergy: -770.1466689 hartree
pointgroup: C01 [X(C14H20O3)]
dipole: -0.8430715 0.3705227 -0.7553483 debye
polarizability: 216.7275456|5.6610943|162.5527174|22.8027622|-18.5886656|118.4321842 unknown
InChI: InChI=1S/C14H20O3/c1-2-3-4-5-6-7-13(16)12-10-11(15)8-9-14(12)17/h8-10,15,17H,2-7H2,1H3
charge 0 multiplicity 1
37 atoms
O  -0.010937 -0.477981 1.637737
O  -1.874657 -2.407274 1.191113
O  -4.905141 1.524541 -1.479671
C  2.430743 0.596363 -0.23933
C  3.928252 0.741326 0.111851
C  1.538584 1.595278 0.532455
C  4.836245 -0.242324 -0.660053
C  0.040718 1.47663 0.184072
C  6.333982 -0.098403 -0.304592
C  -0.6225 0.213339 0.775285
C  7.235843 -1.085501 -1.076976
C  -2.0107 -0.131884 0.309662
C  -2.611498 -1.408662 0.546734
C  -2.787414 0.844042 -0.381937
C  -4.103816 0.582167 -0.80608
C  -3.937682 -1.664064 0.107129
C  -4.686646 -0.682356 -0.560323
H  2.100092 -0.435117 -0.011134
H  2.294855 0.74603 -1.331962
H  4.061342 0.582931 1.20229
H  4.257171 1.782121 -0.095091
H  1.666546 1.425235 1.618289
H  1.876087 2.629341 0.317108
H  4.509471 -1.282485 -0.451763
H  4.703617 -0.087743 -1.751778
H  -0.505014 2.360506 0.578583
H  -0.100988 1.489597 -0.915479
H  6.658936 0.941896 -0.512437
H  6.464191 -0.251949 0.786183
H  7.14029 -0.937159 -2.16951
H  6.955755 -2.13296 -0.856285
H  8.301277 -0.957207 -0.810164
H  -2.349008 1.829287 -0.575943
H  -4.387438 -2.648217 0.293488
H  -5.709837 -0.874425 -0.894766
H  -2.408064 -3.241685 1.243829
H  -4.421257 2.378066 -1.604036
