program: Gaussian 09
title: 000078369
version: EM64L-G09RevD.01
frameworkgroup: C1[X(C5H6BrN3)]
method: RPBEPBE
basis: SDD
operation: Freq
keyword: #p
keyword: freq=noraman
keyword: PBEPBE/SDD
title: #p freq=noraman PBEPBE/SDD
converged: NO YES NO NO
title: Mulliken charges:
elementType: Br N N N C C C C C H H H H H H
charge: -0.023716 -0.679692 -0.018043 -0.698429 0.467985 0.329532 -0.294096 -0.454289 -0.344331 0.227763 0.253624 0.323129 0.298405 0.296500 0.315659
chargesum: 0.00000
title: Mulliken charges with hydrogens summed into heavy atoms:
elementType: Br N N N C C C C C
charge: -0.023716 -0.058159 -0.018043 -0.086270 0.467985 0.329532 -0.294096 -0.226527 -0.090708
polarizability: 1.35620355e+02 -1.13907064e+00 1.03614512e+02 5.73925552e-03 -2.15402081e-03 3.57427303e+01
1716.lowfreq: -389.1642 -2.5382 -0.0003 0.0003 0.0003 9.8343 14.6688 106.5986 191.2813
frequency: -389.1640 106.5944 191.2811 194.8437 252.3669 270.3109 306.9975 340.5341 372.9055 454.8702 462.4136 519.1196 522.7920 582.7124 618.0392 732.2478 803.8518 830.6897 849.6261 883.2545 1006.3244 1034.1222 1146.9544 1242.8935 1291.2663 1336.0061 1355.3051 1407.9450 1488.9005 1561.3387 1566.5384 1631.8664 1666.8831 3109.6691 3155.5947 3551.9604 3581.1088 3706.3819 3716.5732
redmass: 1.0365 5.5958 6.5814 3.5256 2.2881 12.2820 1.4446 3.2475 1.2497 3.6370 1.1630 4.7836 4.6808 5.3805 7.6793 4.3202 4.7925 5.4501 1.4490 1.4513 1.7928 1.5501 2.5339 2.3142 2.4392 2.1927 3.5602 2.5472 4.5157 5.7186 4.0630 1.3944 1.1423 1.0905 1.0929 1.0487 1.0462 1.1004 1.1016
irintensity: 3.3449 0.1259 2.1474 9.7227 50.4497 4.2130 266.0307 1.6536 140.2147 0.7472 164.6960 2.9755 9.5027 4.9494 5.9304 9.2831 3.8205 81.2267 37.1977 1.0419 77.7009 29.1591 22.9758 2.9890 8.2735 52.6041 9.1358 27.7126 68.8577 123.9695 37.8741 125.8149 250.1865 40.6907 4.0773 58.0989 53.3085 28.2550 17.5159
temp: 298.150 k
press: 1.00000 atm
elementType: 35 7 7 7 6 6 6 6 6 1 1 1 1 1 1
symmnumber: 1
zpe: 286225.0 jmol-1
zpe.correction: 0.109017 hartree
zpe.thermalcorrener: 0.117557 hartree
zpe.thermalcorrenthalpy: 0.118501 hartree
zpe.thermalcorrgfe: 0.074988 hartree
zpe.sumelectzpe: -371.186325 hartree
zpe.sumelectthermal: -371.177785 hartree
zpe.sumelectthermalent: -371.176841 hartree
zpe.sumelectthermalfe: -371.220354 hartree
dipole: -2.5125 -5.4224 0.0068
dipole: 5.9762
quadrupole: -49.4632 -57.8225 -67.2449
quadrupole: 9.3018 -0.0369 -0.0084
quadrupole: 8.7137 0.3544 -9.0680 9.3018 -0.0369 -0.0084
hfenergy: -371.2953421 hartree
pointgroup: C01 [X(C5H6Br1N3)]
dipole: -1.1969321 2.0237702 -0.0031246 debye
dipolederiv: -0.7344185 -0.2074488 0.0002065 -0.2490802 -0.2078956 0.0000759 0.0000372 0.0000802 -0.0494071 -0.1654199 -0.1759194 -0.0012264 -0.1645275 -1.28163 0.000886 -0.0011605 0.0021195 -0.7065074 -0.2845313 0.1148451 -0.0000336 -0.3270618 -0.5803155 0.000207 0.0002699 0.0001753 -0.2267401 -1.0692364 0.5677065 -0.0003069 0.6626115 -0.4971157 -0.0031109 0.0030401 -0.0044784 -0.7591508 -0.4489698 0.4394057 0.0004832 -0.0408711 1.2434258 -0.0000757 0.0010362 -0.0000233 0.1135979 0.9839511 -0.875027 0.0003862 -0.6865025 0.1537817 0.0008657 0.0006944 0.0007453 0.1420287 1.1338813 0.4271634 -0.0003737 0.3123721 -0.012005 -0.0000901 -0.0003654 -0.000851 -0.1164757 0.2680583 -0.0533752 -0.0000878 0.3921726 0.1772876 -0.0001915 -0.0011936 0.0002473 -0.1590491 -0.1715459 -0.1978997 -0.0000014 0.1334573 0.1445877 -0.0001658 -0.0003498 -0.0000045 -0.076292 -0.169519 -0.0569187 -0.0000491 -0.0396539 0.0814985 -0.0000152 -0.0000355 -0.0000637 0.1481661 -0.0371194 0.0764989 0.0000338 0.0771849 0.0508069 0.0000141 0.0003151 0.000136 0.1476128 0.2102568 -0.0101597 0.0001653 -0.0123478 0.2561964 -0.000329 -0.0000685 -0.000379 0.373983 0.0933213 0.0361023 0.0005586 0.0261299 0.2255712 -0.0002439 0.0007123 -0.0015288 0.3839328 0.1778918 -0.0514318 0.0004798 -0.052277 0.1120551 0.0014314 -0.0016009 0.0032262 0.3905951 0.2133995 -0.0335417 -0.0002344 -0.0316064 0.1337508 0.0007419 -0.001331 0.0005991 0.3937057 unknown
polarizability: 135.0733776|4.3017058|104.1614804|-0.0167845|-0.0221259|35.7427394 unknown
InChI: InChI=1S/C5H6BrN3/c6-3-1-9-2-4(7)5(3)8/h1-2H,7-8H2
charge 0 multiplicity 1
15 atoms
Br 2.994916 0.523378 -0.00089
N  0.303336 2.176215 0.000089
N  -0.360523 -2.036254 0.000842
N  -2.391116 1.085363 -0.000637
C  0.070997 0.806003 -0.000308
C  -1.26189 0.257464 -0.000319
C  1.132837 -0.138293 -0.000453
C  -1.400096 -1.153617 0.000499
C  0.902415 -1.528154 0.000115
H  -2.405045 -1.595734 0.000784
H  1.734108 -2.238588 0.000091
H  1.263678 2.514693 -0.000149
H  -0.442643 2.861903 0.003392
H  -2.346541 2.097567 -0.007383
H  -3.314935 0.662653 -0.000773
