program: Gaussian 09
title: 000078396
version: EM64L-G09RevD.01
frameworkgroup: C1[X(C10H13NO3)]
method: RPBEPBE
basis: SDD
operation: Freq
keyword: #p
keyword: freq=noraman
keyword: PBEPBE/SDD
title: #p freq=noraman PBEPBE/SDD
converged: YES YES NO NO
title: Mulliken charges:
elementType: O O O N C C C C C C C C C C H H H H H H H H H H H H H
charge: -0.271079 -0.486786 -0.269617 -0.436871 0.303938 0.381211 0.151195 -0.521498 -0.311737 -0.370228 -0.241502 0.214246 -0.686014 -0.782905 0.244338 0.309981 0.246350 0.341879 0.209286 0.209434 0.208260 0.230865 0.230942 0.254160 0.253942 0.216511 0.371697
chargesum: 0.00000
title: Mulliken charges with hydrogens summed into heavy atoms:
elementType: O O O N C C C C C C C C C C
charge: -0.271079 -0.115089 -0.269617 -0.094992 0.303938 0.381211 0.151195 -0.277159 -0.001756 -0.123877 0.177218 0.214246 -0.015947 -0.058292
polarizability: 2.11321221e+02 -1.44076457e+00 1.30947004e+02 7.28120932e-02 6.43652158e-02 6.64402914e+01
1716.lowfreq: -7.5822 -5.0779 -0.0009 -0.0007 -0.0005 5.2318 41.1295 51.9826 72.9689
frequency: 41.1152 51.9470 72.9689 89.2794 100.6020 108.9525 168.8743 189.4243 224.0090 245.1354 255.1399 291.2881 302.6174 338.0725 371.3203 384.3886 445.6283 470.8997 541.5672 570.0703 590.6911 615.0491 623.4408 709.1287 723.0066 727.8784 803.8667 812.4504 826.0987 836.0097 855.9865 933.8782 961.9704 962.3290 996.1673 1037.9168 1040.0105 1081.5890 1116.3647 1137.2699 1147.1320 1159.6857 1225.5824 1231.6778 1263.1907 1271.4204 1321.0486 1369.3743 1388.6490 1391.2858 1401.3903 1434.7081 1449.6208 1460.3663 1468.7645 1478.0591 1489.5216 1502.3462 1518.6858 1606.7649 1614.5558 1634.2043 2957.3761 2994.3369 2997.1315 3015.2527 3094.4784 3095.0605 3097.4519 3105.3825 3144.6319 3166.6380 3192.5889 3517.3390 3617.3039
redmass: 2.0890 1.4354 4.7750 3.3720 4.1145 1.8036 4.1181 4.7314 2.0486 1.8147 5.4301 5.0701 1.1481 4.8175 3.4231 5.0539 3.1123 3.9225 8.2265 4.3628 3.6316 3.3552 4.9507 1.5473 6.1016 1.8774 1.3425 4.3866 1.4851 1.2535 3.9196 5.4648 2.8914 1.3261 1.5747 2.5963 1.6252 2.4970 2.1933 1.4418 1.2139 1.7946 2.0058 2.9096 1.1384 1.7773 2.3868 1.4473 1.2154 2.8518 1.4947 4.3140 1.0455 1.0401 1.1033 1.0659 1.1486 2.0379 3.0314 7.6412 4.4116 7.0432 1.0555 1.0359 1.0361 1.1075 1.0989 1.0981 1.1007 1.1013 1.0920 1.0893 1.0954 1.0768 1.0664
irintensity: 2.8676 0.0023 11.0011 0.0361 5.3610 1.7063 1.7305 0.7320 0.7318 0.0018 4.3691 2.0540 158.2960 2.1372 0.3691 0.2514 14.5656 13.3326 5.6088 30.2069 3.0245 4.8152 1.9262 26.7830 14.4193 49.1262 26.5554 1.2843 49.9081 21.9489 4.7103 1.9256 55.3777 8.1923 16.8828 44.3801 15.8136 292.2003 8.5522 4.6444 26.2437 119.4267 120.2689 86.4050 0.0212 98.5531 3.0932 24.7092 62.2964 43.8284 21.3324 87.2613 15.3595 11.9071 27.3595 21.7124 23.8995 128.8278 544.8269 39.3064 154.5824 39.2145 37.4710 16.8105 26.8729 35.7725 28.7696 10.1981 20.7592 36.5882 5.0500 9.6742 7.4730 45.7627 44.5007
temp: 298.150 k
press: 1.00000 atm
elementType: 8 8 8 7 6 6 6 6 6 6 6 6 6 6 1 1 1 1 1 1 1 1 1 1 1 1 1
symmnumber: 1
zpe: 565100.4 jmol-1
zpe.correction: 0.215235 hartree
zpe.thermalcorrener: 0.229835 hartree
zpe.thermalcorrenthalpy: 0.230779 hartree
zpe.thermalcorrgfe: 0.173024 hartree
zpe.sumelectzpe: -668.242813 hartree
zpe.sumelectthermal: -668.228214 hartree
zpe.sumelectthermalent: -668.227270 hartree
zpe.sumelectthermalfe: -668.285024 hartree
dipole: -1.7188 3.1842 0.0171
dipole: 3.6185
quadrupole: -69.1206 -77.2738 -85.7906
quadrupole: 14.7039 -0.0021 0.0356
quadrupole: 8.2744 0.1212 -8.3956 14.7039 -0.0021 0.0356
hfenergy: -668.4580484 hartree
pointgroup: C01 [X(C10H13N1O3)]
dipole: 0.6934293 1.2417135 -0.0633751 debye
polarizability: 211.2797309|0.5098361|130.7053467|3.0670107|-3.7347355|66.7234386 unknown
InChI: InChI=1S/C10H13NO3/c1-3-14-8-4-5-9(10(13)6-8)11-7(2)12/h4-6,11,13H,3H2,1-2H3
charge 0 multiplicity 1
27 atoms
O  3.115932 0.247183 0.141359
O  -1.161667 2.53595 -0.083289
O  -3.203173 -1.976532 0.132927
N  -2.54266 0.270944 0.017443
C  -1.128252 0.144513 0.056346
C  1.716231 0.133234 0.118111
C  -0.38233 1.358827 0.001741
C  1.018804 1.364923 0.031485
C  -0.416824 -1.07357 0.143463
C  0.997178 -1.084194 0.174394
C  3.900579 -1.000731 0.223625
C  -3.493634 -0.74302 0.054856
C  5.372603 -0.597511 0.225494
C  -4.942474 -0.262157 -0.006346
H  1.594346 2.296469 -0.010865
H  -0.985687 -2.004077 0.186694
H  1.513936 -2.044925 0.242506
H  -2.870663 1.238909 -0.044835
H  3.630653 -1.545145 1.151875
H  3.659687 -1.645064 -0.646766
H  6.012201 -1.496661 0.287889
H  5.627832 -0.049716 -0.697657
H  5.597385 0.052354 1.08839
H  -5.479437 -0.62831 0.885752
H  -5.432234 -0.710858 -0.888033
H  -5.047523 0.835345 -0.060593
H  -0.59451 3.342821 -0.120768
