program: Gaussian 09
title: 000078377
version: EM64L-G09RevD.01
frameworkgroup: C1[X(C15H13NO3)]
method: RPBEPBE
basis: SDD
operation: Freq
keyword: #p
keyword: freq=noraman
keyword: PBEPBE/SDD
title: #p freq=noraman PBEPBE/SDD
converged: YES YES NO NO
title: Mulliken charges:
elementType: O O O N C C C C C C C C C C C C C C C H H H H H H H H H H H H H
charge: -0.256074 -0.222159 -0.221673 0.024051 0.545766 0.519111 -0.343860 -0.310695 -0.374825 -0.393692 -0.367172 -0.407116 0.368161 0.320981 -0.375012 -0.377372 -0.360175 -0.367578 -0.536275 0.223102 0.217794 0.230620 0.237649 0.228102 0.228754 0.283455 0.284804 0.254647 0.244919 0.225637 0.250579 0.225543
chargesum: 0.00000
title: Mulliken charges with hydrogens summed into heavy atoms:
elementType: O O O N C C C C C C C C C C C C C C C
charge: -0.256074 -0.222159 -0.221673 0.024051 0.545766 0.519111 -0.120758 -0.092901 -0.144205 -0.156042 -0.139069 -0.178362 0.368161 0.320981 -0.091557 -0.092567 -0.105527 -0.122659 0.165485
polarizability: 5.73651381e+02 -7.49168570e+00 1.74543939e+02 -6.83209574e-02 5.28777332e-02 7.35492289e+01
1716.lowfreq: -4.7715 -3.3389 -0.0008 -0.0005 0.0004 2.4281 22.8952 28.8678 46.9609
frequency: 22.8097 28.8565 46.9595 59.0146 72.6111 110.7076 145.6404 157.4164 178.1501 181.6097 230.5628 231.4618 300.0310 303.8644 370.5102 381.1538 412.8218 416.2143 438.0684 468.0983 487.0509 516.5586 533.6243 540.7995 625.8772 632.6985 647.7890 664.1616 725.7322 740.6119 747.0458 774.9281 809.8317 826.6514 830.2643 839.3343 851.7670 866.6481 900.4689 943.6262 966.7488 977.9238 982.6488 993.1326 994.3298 997.4316 998.8269 1095.4060 1110.6222 1111.4616 1116.8653 1156.1215 1176.7884 1182.5694 1205.8503 1222.1562 1234.5269 1257.8617 1293.5811 1295.8247 1317.2740 1327.5429 1353.7288 1382.5523 1404.9528 1430.1896 1434.6884 1435.7250 1466.6535 1470.2457 1481.3503 1506.0474 1566.8998 1578.9899 1597.9179 1622.6871 1638.7892 2965.2786 3056.2840 3091.9288 3105.4466 3124.7470 3131.6864 3136.3290 3141.4794 3149.6983 3166.6810 3170.4648 3180.9927 3183.6103
redmass: 4.3007 5.6715 6.0242 5.1805 6.8472 3.8786 7.3970 4.1143 5.4251 1.9002 4.8414 1.3783 4.7839 3.8213 4.3712 7.8898 2.9201 2.9118 5.0677 5.1066 2.8869 5.8236 2.5631 5.3824 7.1607 7.1234 7.3763 4.5384 3.5262 5.6719 3.9203 8.1681 1.3230 5.8650 1.4620 1.3036 1.6771 4.1972 2.0392 1.3888 1.3490 1.2451 8.8853 1.3701 1.2714 2.6624 2.9713 3.2089 1.2602 1.3472 1.3958 1.3269 1.5367 1.3113 2.8038 3.1886 2.0254 1.7764 1.7892 1.4913 1.8419 1.3967 6.2659 4.1494 4.1091 3.9345 1.4053 2.6304 1.0501 1.0808 2.4076 2.6450 6.6439 7.0419 5.6949 6.2665 5.2894 1.0327 1.1043 1.0910 1.0867 1.0893 1.0998 1.0901 1.0880 1.0889 1.0938 1.0963 1.0947 1.0955
irintensity: 0.1181 0.8154 0.6215 3.0842 0.1818 2.5484 1.7306 4.0507 1.2743 1.8134 5.1872 0.8038 3.0588 0.0327 0.1648 11.7213 0.0007 0.0290 5.0092 0.2543 0.4616 0.9142 32.7648 39.5500 1.1815 0.5550 8.2318 27.8478 2.0807 2.1336 0.2885 20.5220 9.2980 1.5682 17.1739 2.5120 89.5255 1.9284 6.7967 8.4700 9.3205 44.0123 79.6290 1.0912 8.2693 9.8404 0.0351 40.0886 0.2000 26.2169 5.3689 10.4005 910.2681 12.1470 90.7387 667.8076 220.6323 78.5164 4.4624 1.0458 0.7050 41.3055 102.5682 11.8280 16.3508 47.2334 34.4001 19.8107 14.8603 66.0580 5.8463 120.7835 99.7602 6.9409 809.7628 57.4266 33.9578 106.4488 43.7381 1.7701 30.5741 15.2250 22.7915 11.1127 6.2097 6.4202 18.6114 13.2712 0.5093 1.7496
temp: 298.150 k
press: 1.00000 atm
elementType: 8 8 8 7 6 6 6 6 6 6 6 6 6 6 6 6 6 6 6 1 1 1 1 1 1 1 1 1 1 1 1 1
symmnumber: 1
zpe: 640322.5 jmol-1
zpe.correction: 0.243886 hartree
zpe.thermalcorrener: 0.260657 hartree
zpe.thermalcorrenthalpy: 0.261601 hartree
zpe.thermalcorrgfe: 0.197170 hartree
zpe.sumelectzpe: -858.379373 hartree
zpe.sumelectthermal: -858.362601 hartree
zpe.sumelectthermalent: -858.361657 hartree
zpe.sumelectthermalfe: -858.426088 hartree
dipole: 9.7900 -0.8848 0.0024
dipole: 9.8299
quadrupole: -138.8732 -98.9292 -115.7052
quadrupole: -15.6792 0.1513 -0.0037
quadrupole: -21.0373 18.9067 2.1306 -15.6792 0.1513 -0.0037
hfenergy: -858.6232586 hartree
pointgroup: C01 [X(C15H13N1O3)]
dipole: -3.8496129 -0.3638991 -0.0684516 debye
polarizability: 573.4947475|9.113265|174.3009951|6.5506056|5.7374214|73.9488061 unknown
InChI: InChI=1S/C15H13NO3/c1-19-15-10-6-13(7-11-15)3-2-12-4-8-14(9-5-12)16(17)18/h2-11H,1H3
charge 0 multiplicity 1
32 atoms
O  -6.469618 0.457157 -0.079166
O  6.35158 -1.427677 -0.029702
O  6.640245 0.835266 0.095956
N  5.889994 -0.218704 0.031466
C  1.616067 0.319157 0.017217
C  -2.263823 -0.154329 -0.057853
C  0.172349 0.566088 0.014128
C  -0.818046 -0.385378 -0.052216
C  2.196242 -0.987549 -0.047807
C  2.50307 1.438174 0.088145
C  -2.858914 1.145486 0.008369
C  -3.140877 -1.273201 -0.133141
C  4.428948 -0.032216 0.02721
C  -5.101633 0.174407 -0.076734
C  3.586036 -1.168276 -0.043339
C  3.897019 1.275916 0.09367
C  -4.248563 1.309956 -0.000525
C  -4.54212 -1.126767 -0.143367
C  -7.402824 -0.672186 -0.161985
H  -0.115938 1.624725 0.070149
H  -0.523669 -1.443408 -0.108781
H  1.552097 -1.870693 -0.10253
H  2.080187 2.448273 0.139185
H  -2.225535 2.036833 0.067283
H  -2.712605 -2.28196 -0.185101
H  4.037843 -2.162537 -0.092985
H  4.578815 2.128569 0.147548
H  -4.707124 2.30211 0.049913
H  -5.177854 -2.014873 -0.202267
H  -7.25953 -1.240791 -1.10075
H  -8.403407 -0.2169 -0.151568
H  -7.290113 -1.348775 0.706776
