program: Gaussian 09
title: 000078375
version: EM64L-G09RevD.01
frameworkgroup: C1[X(C10H11NO)]
method: RPBEPBE
basis: SDD
operation: Freq
keyword: #p
keyword: freq=noraman
keyword: PBEPBE/SDD
title: #p freq=noraman PBEPBE/SDD
converged: NO YES NO NO
title: Mulliken charges:
elementType: O N C C C C C C C C C C H H H H H H H H H H H
charge: -0.248863 -0.234453 -0.387775 -0.454617 -0.524625 0.169950 0.431057 -0.345197 -0.361502 -0.225579 -0.236082 -0.248976 0.232785 0.240589 0.231632 0.236846 0.244958 0.256522 0.305878 0.239492 0.226449 0.223447 0.228063
chargesum: 0.00000
title: Mulliken charges with hydrogens summed into heavy atoms:
elementType: O N C C C C C C C C C C
charge: -0.248863 -0.234453 0.085599 0.013861 -0.023145 0.169950 0.431057 -0.039319 -0.122010 0.000871 -0.012635 -0.020913
polarizability: 1.64979440e+02 3.68187452e+00 1.19172144e+02 -1.45394943e+00 3.19081069e+00 5.93589959e+01
1716.lowfreq: -20.2102 -14.4615 -6.9123 0.0010 0.0012 0.0012 52.0021 85.7026 145.5961
frequency: 51.7922 85.5896 145.5881 178.5088 196.5397 293.0441 321.9861 362.3234 408.8488 502.4737 524.2776 557.2342 613.2723 627.2932 649.4583 696.3824 712.2046 766.9991 837.3121 841.3592 896.9154 914.0158 920.3001 951.2154 973.3086 984.2582 999.5251 1026.1285 1040.1744 1071.4016 1084.1518 1113.6388 1159.4066 1173.9696 1195.9417 1201.0028 1212.5077 1228.5749 1282.1370 1303.4293 1321.2717 1333.1182 1367.8802 1387.0549 1446.8819 1453.5861 1477.7008 1489.1270 1495.9635 1586.1867 1613.3634 1632.1840 2973.3269 3007.2312 3022.9072 3050.7467 3087.3604 3099.8002 3127.2979 3138.0917 3155.6165 3167.8773 3192.6489
redmass: 4.2067 3.3188 2.5542 3.1147 2.8135 4.0796 6.5979 5.5441 2.9385 2.9258 4.6658 2.8280 5.9339 3.4566 6.5433 1.9436 3.4224 1.7597 1.4266 1.5518 1.4872 1.5718 3.6465 2.3527 1.3525 5.9350 1.3117 2.3045 2.0314 1.7873 1.7878 2.9456 1.2846 1.0514 1.3867 1.4004 2.4842 1.2259 1.3364 2.4338 1.3501 1.3554 2.4757 4.6641 2.3844 1.0915 1.1027 2.0456 1.1717 6.2467 5.9793 10.6985 1.0643 1.0661 1.0652 1.0972 1.0990 1.1019 1.0849 1.0898 1.0938 1.0990 1.0950
irintensity: 3.0677 0.7446 1.7228 3.2253 2.5871 1.3068 2.1231 1.7452 0.1040 8.4390 6.9394 4.6558 1.9921 4.8891 5.8762 43.4809 2.4019 76.8201 5.1900 12.3967 2.0353 7.5904 3.0719 5.7883 0.4484 0.4500 2.4534 1.1772 25.0487 4.7915 1.0955 26.3296 5.6326 0.8651 11.1176 33.4890 63.8803 6.8338 4.4972 153.2784 2.7977 1.4191 123.2417 14.3590 7.0727 12.4603 31.0214 129.1650 3.4741 0.9348 88.5258 243.3522 41.1042 16.8097 27.8024 27.0416 18.9835 30.1189 1.1511 16.8486 38.8956 12.8215 9.3527
temp: 298.150 k
press: 1.00000 atm
elementType: 8 7 6 6 6 6 6 6 6 6 6 6 1 1 1 1 1 1 1 1 1 1 1
symmnumber: 1
zpe: 494845.5 jmol-1
zpe.correction: 0.188477 hartree
zpe.thermalcorrener: 0.198339 hartree
zpe.thermalcorrenthalpy: 0.199283 hartree
zpe.thermalcorrgfe: 0.152672 hartree
zpe.sumelectzpe: -516.786433 hartree
zpe.sumelectthermal: -516.776571 hartree
zpe.sumelectthermalent: -516.775627 hartree
zpe.sumelectthermalfe: -516.822238 hartree
dipole: 1.2152 -4.0313 0.1018
dipole: 4.2117
quadrupole: -59.3631 -72.1728 -73.1098
quadrupole: -6.2280 -0.0301 1.5560
quadrupole: 8.8521 -3.9575 -4.8946 -6.2280 -0.0301 1.5560
hfenergy: -516.9749099 hartree
pointgroup: C01 [X(C10H11N1O1)]
dipole: 0.4428103 -1.5958458 0.0541336 debye
dipolederiv: -0.5553826 0.1388191 -0.0078059 -0.3762296 -1.1548843 0.0549577 0.0528774 0.034244 -0.3476729 -1.640733 -0.3080246 0.0528857 -0.3922274 -0.7953507 0.0079225 0.0586175 0.0794808 -0.2013712 0.1638756 -0.1624777 -0.0195283 -0.2123116 0.4615756 0.025874 -0.0249064 0.0343793 0.3095677 0.0029984 -0.0434054 -0.0194621 -0.076422 0.0367387 0.042011 0.0369572 0.0076954 0.1465868 -0.3196216 0.1591708 0.0249046 0.1235845 -0.0334445 0.0139559 0.0501552 -0.0006422 0.1284089 1.2646462 0.2135271 -0.0668901 0.8264819 1.4984664 -0.0942246 -0.1507093 -0.0715128 0.1538675 1.2908845 0.0521094 -0.0095821 -0.0829899 -0.0230505 0.0267456 -0.0157432 -0.0003059 0.0975422 -0.3360381 0.0186334 0.0060208 0.1995488 -0.0565012 0.0076064 0.0081778 0.0004772 -0.1633574 -0.2641281 -0.0039796 0.0020883 -0.2036854 -0.0143724 0.0244425 -0.0237813 0.0290121 -0.2027091 0.1141711 -0.0254084 -0.0050916 -0.0632766 0.1534588 0.0354828 -0.0119319 0.0255538 -0.1485609 0.0661989 0.0009376 0.0011019 0.1074868 0.1286519 0.0280172 0.0207398 0.0295052 -0.1529688 -0.0292572 -0.0127692 0.0010229 -0.0409979 -0.1537827 0.0043134 -0.0069045 0.0008594 -0.1799552 0.0337915 -0.0030518 -0.0417428 0.04208 -0.0539355 -0.0619573 -0.0263594 -0.1282613 -0.1116183 0.0323292 -0.0920184 0.0673764 -0.0187033 -0.050324 0.0619376 0.0634283 0.0834967 -0.0144776 -0.0430766 0.1050155 0.0398541 0.140601 -0.0387462 -0.0448116 0.070505 -0.0714951 0.0558332 0.061958 -0.0064825 -0.0145253 -0.0243153 0.0631841 0.0018164 -0.0759023 0.0413583 -0.1409153 0.0496709 -0.0057753 0.0369011 0.0381054 0.0635311 0.0093579 0.0799252 0.0408325 -0.0918051 -0.0043081 -0.0625312 -0.0521833 -0.0731348 0.011174 -0.0438435 -0.107861 -0.0500553 0.0543467 0.163256 -0.0583727 -0.0118074 -0.0167087 0.0645746 -0.0161537 -0.0138666 -0.0057996 0.1772942 0.0560158 0.097249 0.0136297 0.1028017 -0.0528173 -0.0255409 0.0123209 -0.0266531 0.1597326 0.0270526 0.0777539 0.0091589 0.1024911 -0.0773579 -0.0255486 0.0138562 -0.0231754 0.1505262 0.0096812 -0.0903806 -0.0089077 -0.1134774 -0.0679536 -0.0239731 -0.0121307 -0.0226424 0.1535824 -0.1439846 0.0114614 0.0025822 0.0112987 0.0911656 -0.0083873 0.002536 -0.0063514 0.1681237 unknown
polarizability: 165.115275|2.6514206|119.085844|-1.5919955|2.6622654|59.3094604 unknown
InChI: InChI=1S/C10H11NO/c12-10-7-4-8-11(10)9-5-2-1-3-6-9/h1-3,5-6H,4,7-8H2
charge 0 multiplicity 1
23 atoms
O  1.505463 2.0883 -0.165486
N  0.856696 -0.204484 -0.012934
C  1.533018 -1.528814 -0.009867
C  3.013871 -1.198374 0.307536
C  3.186558 0.252317 -0.193215
C  1.778264 0.857378 -0.119814
C  -0.568281 -0.10171 -0.012407
C  -1.222145 1.157031 0.117733
C  -1.35702 -1.279827 -0.13947
C  -2.630687 1.21726 0.126307
C  -2.765719 -1.201086 -0.127327
C  -3.414532 0.046056 0.007581
H  1.422533 -2.017052 -0.999064
H  1.082547 -2.188354 0.752155
H  3.703858 -1.911622 -0.171813
H  3.180306 -1.243318 1.397982
H  3.525564 0.293446 -1.246112
H  3.887775 0.857103 0.402957
H  -0.62345 2.065645 0.199074
H  -0.883984 -2.258876 -0.259018
H  -3.11819 2.193285 0.228866
H  -3.354646 -2.119818 -0.226824
H  -4.5081 0.104713 0.017359
