program: Gaussian 09
title: 000078385
version: EM64L-G09RevD.01
frameworkgroup: C1[X(C8H8O3S)]
method: RPBEPBE
basis: SDD
operation: Freq
keyword: #pfreq=noraman
keyword: PBEPBE/SDD
title: #p freq=noraman PBEPBE/SDD
converged: YES YES NO NO
title: Mulliken charges:
elementType: S O O O C C C C C C C C H H H H H H H H
charge: 0.334436 -0.225111 -0.412064 -0.243044 -0.501742 -0.487736 0.284741 -0.273259 -0.246098 0.185824 -0.140006 -0.513139 0.241307 0.277096 0.292688 0.260755 0.263027 0.252637 0.271947 0.377742
chargesum: 0.00000
title: Mulliken charges with hydrogens summed into heavy atoms:
elementType: S O O O C C C C C C C C
charge: 0.334436 -0.225111 -0.034322 -0.243044 0.016660 0.065707 0.284741 -0.273259 0.016928 0.185824 0.112631 -0.241192
polarizability: 1.60962219e+02 -9.50916747e+00 1.13662378e+02 -1.41544460e+00 -1.18238054e+00 5.64827565e+01
1716.lowfreq: -5.2609 0.0006 0.0009 0.0025 3.4964 9.8497 25.3649 33.8707 59.7069
frequency: 25.3380 33.8371 59.6871 80.6757 108.3932 166.9521 186.0178 226.1297 293.5928 421.7616 428.9450 473.9196 512.4055 548.5871 574.7769 604.3105 634.0808 648.5133 682.7025 720.9489 725.6488 797.6212 824.2457 846.7101 892.0010 923.3156 925.3715 1010.2139 1048.7248 1067.0744 1090.0537 1104.1118 1150.5885 1206.0043 1229.9620 1253.4204 1257.1556 1323.6179 1342.8420 1373.4756 1441.5517 1447.6147 1453.7651 1527.9654 1571.8873 1661.6428 2988.3274 3002.2527 3045.2660 3075.1023 3174.2502 3191.4360 3233.9200 3513.6597
redmass: 8.3808 5.0209 4.4881 4.7818 2.7728 5.0086 6.2190 7.8145 7.8514 4.6618 5.9772 3.8769 2.1836 2.8946 3.7047 3.0392 7.9575 1.4246 6.3967 6.5624 1.1716 1.7426 4.4353 1.3414 4.3811 1.7999 2.5715 2.2345 2.5228 1.7707 1.2594 1.9331 1.2246 1.9431 1.3104 1.7170 1.4329 1.9999 2.4556 2.0554 1.1074 1.1931 4.2728 5.2674 8.6162 8.0872 1.0625 1.0648 1.0959 1.0957 1.0899 1.0975 1.1002 1.0639
irintensity: 3.4698 0.0754 1.4419 2.7803 1.0165 0.6412 9.6293 1.6286 3.2048 1.0289 5.8141 36.4070 64.1570 8.7763 20.0019 15.2588 4.5050 122.8127 1.7965 11.8172 105.0214 26.6299 10.0209 5.6093 4.6721 4.4467 6.5469 42.8891 132.4846 168.1101 23.9076 10.0980 0.9217 9.5667 3.5861 139.8122 10.3117 111.6261 18.3582 43.6753 3.6388 77.8845 66.2278 16.2111 190.2606 192.6166 13.6896 33.5564 6.6233 7.9736 4.6155 2.5493 0.5266 25.2445
temp: 298.150 k
press: 1.00000 atm
elementType: 16 8 8 8 6 6 6 6 6 6 6 6 1 1 1 1 1 1 1 1
symmnumber: 1
zpe: 377735.1 jmol-1
zpe.correction: 0.143872 hartree
zpe.thermalcorrener: 0.155721 hartree
zpe.thermalcorrenthalpy: 0.156665 hartree
zpe.thermalcorrgfe: 0.103153 hartree
zpe.sumelectzpe: -932.495404 hartree
zpe.sumelectthermal: -932.483555 hartree
zpe.sumelectthermalent: -932.482611 hartree
zpe.sumelectthermalfe: -932.536123 hartree
dipole: -1.3391 2.7305 -1.2639
dipole: 3.2934
quadrupole: -58.4211 -82.5582 -79.8281
quadrupole: -5.9575 -1.7799 -2.9932
quadrupole: 15.1813 -8.9557 -6.2256 -5.9575 -1.7799 -2.9932
hfenergy: -932.6392761 hartree
pointgroup: C01 [X(C8H8O3S1)]
dipole: -0.5573381 -1.054747 0.5057544 debye
dipolederiv: 0.0609667 0.027139 -0.0085915 0.1061386 -0.2006055 0.0551742 -0.0133582 0.0535325 0.1618312 -0.8399335 -0.0699077 0.0045073 -0.3909663 -0.8368354 0.0740895 0.0662396 0.0762861 -0.3156888 -1.2257068 -0.3678674 -0.3197402 -0.3072502 -0.4237621 -0.0329814 -0.3080402 -0.0374242 -0.4816803 -0.764922 0.1004861 0.040524 -0.070381 -0.758077 -0.3197265 -0.0762757 -0.2854241 -0.5212113 -0.2987163 0.1297529 -0.0266433 0.3326893 -0.1397135 -0.0176218 0.0575968 -0.0341797 0.1127928 -0.2464716 0.1035655 0.0376051 0.3858127 -0.1437886 -0.0848109 0.0295628 -0.0510348 0.0877464 1.703768 0.2309375 -0.0156429 0.4200926 0.8809828 -0.0927784 -0.0582831 -0.0876864 0.1824371 -0.6861839 -0.489376 0.067235 -0.6822965 -0.0346221 -0.0294787 0.0746882 -0.0310276 -0.1778541 0.2896038 0.0039523 0.0045315 0.3029209 -0.0840904 0.0041022 -0.0411573 0.0012324 -0.1075843 1.7169234 0.0762318 0.1901892 0.0682114 0.953657 0.5216976 0.2338337 0.4852929 0.5559546 -0.3788306 0.1173023 -0.0192781 0.2469436 -0.0485901 -0.0112052 -0.0347731 -0.0099701 -0.1512039 -0.0929972 0.0683473 -0.0051135 -0.2057365 0.2544225 -0.0775451 0.0341558 -0.073827 -0.2720474 0.0198347 -0.0491501 0.0426763 -0.0748326 0.0129283 0.0893398 0.0238182 0.0945938 -0.0018177 0.1127012 -0.0128837 -0.0161911 -0.0871803 0.0662816 -0.0560532 -0.0707162 -0.050903 0.0029636 0.1980185 0.0168432 0.0168433 -0.1266811 0.0695357 0.0590889 0.0464088 0.0531798 0.0643653 0.0370155 -0.0016579 -0.0257281 -0.0546614 0.1044091 -0.0428042 -0.0220534 -0.0618584 -0.0442016 0.0574469 0.0788218 -0.0141576 0.1144724 0.0434225 0.0205854 -0.0202605 0.0198365 0.1777777 0.0713027 -0.0507012 0.0050912 -0.0919566 -0.0329865 0.0302971 0.0098872 0.0306584 0.1930819 0.0020563 0.0060383 -0.0049281 -0.016169 0.0965106 0.0156893 -0.0039584 0.0154498 0.2096262 0.2641243 0.0821258 0.0468114 0.1308301 0.2209211 -0.1050588 0.0726851 -0.1067271 0.3247125 unknown
polarizability: 161.4906131|8.0938191|113.1202383|1.0814758|-1.6286827|56.4965017 unknown
InChI: InChI=1S/C8H8O3S/c9-6(3-4-8(10)11)7-2-1-5-12-7/h1-2,5,10H,3-4H2
charge 0 multiplicity 1
20 atoms
S  -3.068835 1.189414 -0.245288
O  -0.125427 1.973855 -0.320278
O  4.629471 0.300209 0.330808
O  3.464913 -1.305936 -0.872309
C  0.9286 -0.213198 0.009857
C  2.241861 0.560621 0.203829
C  -0.275912 0.727201 -0.128669
C  -1.613932 0.121736 -0.062138
C  -1.994181 -1.212252 0.115957
C  3.451529 -0.264021 -0.177908
C  -3.414262 -1.414835 0.112118
C  -4.128184 -0.234109 -0.067657
H  0.762658 -0.922762 0.841073
H  1.000691 -0.831802 -0.907542
H  2.225002 1.472971 -0.425293
H  2.361871 0.924149 1.238814
H  -1.273638 -2.024469 0.240544
H  -3.890109 -2.389993 0.237147
H  -5.208061 -0.09851 -0.108405
H  5.408745 -0.24107 0.028041
