program: Gaussian 09
title: 000078365
version: EM64L-G09RevD.01
frameworkgroup: C1[X(C7H12O2)]
method: RPBEPBE
basis: SDD
operation: Freq
keyword: #pfreq=noraman
keyword: PBEPBE/SDD
title: #p freq=noraman PBEPBE/SDD
converged: YES YES NO NO
title: Mulliken charges:
elementType: O O C C C C C C C H H H H H H H H H H H H
charge: -0.270359 -0.242154 -0.161218 -0.469246 -0.464337 -0.421197 -0.425637 0.201967 -0.504131 0.259437 0.215966 0.251356 0.223346 0.235460 0.213512 0.219140 0.220663 0.204449 0.231901 0.239931 0.241153
chargesum: 0.00000
title: Mulliken charges with hydrogens summed into heavy atoms:
elementType: O O C C C C C C C
charge: -0.270359 -0.242154 0.098218 -0.001925 -0.005531 0.011455 -0.000525 0.201967 0.208853
polarizability: 9.95031185e+01 -1.44933964e+00 7.16520784e+01 -1.12900967e+00 2.03981983e+00 6.66295309e+01
1716.lowfreq: -22.1585 0.0004 0.0006 0.0008 3.6100 7.9727 13.9677 37.6616 93.9938
frequency: -5.3336 37.0535 93.9824 126.5032 162.4510 233.8587 259.6886 308.8358 348.4314 525.2913 602.4050 679.2793 707.1268 777.0035 814.5557 859.4683 878.0495 897.8283 936.8847 967.2076 986.0738 1010.3944 1060.4786 1073.7883 1112.1575 1117.3878 1147.5038 1160.6518 1174.0064 1203.6810 1248.4635 1270.5480 1286.4652 1296.9911 1302.4158 1311.0624 1348.6022 1421.4139 1451.9412 1464.6012 1468.5651 1468.6000 1474.0891 1489.8829 1640.0460 2991.4025 2997.9552 3001.9259 3003.0424 3017.0348 3033.9475 3052.2177 3065.0846 3074.1936 3088.4544 3103.6613 3147.3082
redmass: 3.2853 2.3060 1.0759 3.1231 2.3592 3.0158 3.1468 4.3084 4.2738 2.1706 2.5933 4.5371 7.1627 1.3676 2.3052 2.2995 5.1998 2.4575 1.8364 1.6037 2.3884 1.7248 2.2427 3.9278 1.2774 2.7954 1.4461 1.3991 1.5690 1.5050 1.1758 1.3030 1.1775 1.2314 1.4364 1.3762 1.6318 1.1949 1.0503 1.0507 1.0814 1.0845 1.0858 1.0994 8.9427 1.0618 1.0621 1.0607 1.0297 1.0637 1.0859 1.0985 1.1025 1.1045 1.1043 1.1043 1.1047
irintensity: 1.3148 0.6360 0.3242 1.3835 1.7190 7.9127 8.0954 13.4448 1.8649 0.2516 2.7439 5.2265 6.4002 9.0266 2.7446 10.3130 3.3244 11.1097 2.8413 4.8270 16.3627 5.8070 1.1659 15.6043 1.0128 239.6786 7.6044 23.7383 16.6061 13.5405 2.7732 2.1719 15.7233 6.1049 16.5259 7.1969 44.9007 23.6280 14.4497 11.7063 4.7011 9.5999 13.0070 3.8736 152.2895 35.7982 24.5965 39.1587 30.9448 39.5922 6.9875 22.3999 16.8442 19.2917 80.7876 27.9791 17.7910
temp: 298.150 k
press: 1.00000 atm
elementType: 8 8 6 6 6 6 6 6 6 1 1 1 1 1 1 1 1 1 1 1 1
symmnumber: 1
zpe: 471220.7 jmol-1
zpe.correction: 0.179478 hartree
zpe.thermalcorrener: 0.188379 hartree
zpe.thermalcorrenthalpy: 0.189323 hartree
zpe.thermalcorrgfe: 0.144721 hartree
zpe.sumelectzpe: -423.670232 hartree
zpe.sumelectthermal: -423.661332 hartree
zpe.sumelectthermalent: -423.660388 hartree
zpe.sumelectthermalfe: -423.704990 hartree
dipole: -0.0381 -1.1659 -1.0632
dipole: 1.5784
quadrupole: -45.7853 -56.5294 -56.7188
quadrupole: -1.7233 -1.1755 -3.1430
quadrupole: 7.2259 -3.5183 -3.7076 -1.7233 -1.1755 -3.1430
hfenergy: -423.8497109 hartree
pointgroup: C01 [X(C7H12O2)]
dipole: -0.0393981 -0.4321092 -0.4442336 debye
dipolederiv: -1.2826795 0.2341328 0.2595585 0.336269 -0.4548167 -0.2152162 0.3519203 -0.2063286 -0.5383471 -0.6918195 -0.1082905 -0.137143 0.0899691 -0.547516 -0.2652216 0.0530567 -0.3174786 -0.6695071 -0.4034464 -0.062808 -0.0030989 -0.1097152 -0.0036021 0.0173953 0.0345277 0.0340561 0.0939465 0.0197734 0.0034078 0.022001 -0.1002204 0.0247595 -0.0340407 0.0231558 -0.0094828 0.1189427 0.0170712 0.0142491 -0.0360566 0.1202982 0.1061107 0.0701261 -0.1533965 -0.0293415 0.1019362 0.0480296 -0.0186875 0.0280574 0.0090805 0.0054236 0.0174344 -0.0381597 0.0333365 0.1499617 0.0343021 0.0107497 -0.0271949 -0.0344255 0.0375699 0.0165217 0.0881404 0.0705909 0.1571639 1.6009825 -0.065543 -0.108903 -0.333735 0.5956936 0.527625 -0.3466416 0.5719983 0.8178343 0.6088186 -0.0539147 -0.0519193 -0.0012961 0.2601183 -0.024916 0.0378358 -0.034981 0.2369426 0.0622361 0.0068494 0.0020418 0.0259655 0.0181917 -0.060095 0.0091391 -0.0569616 -0.0870416 0.0310778 0.009401 0.010096 0.0095045 0.0066775 0.0939972 0.0075647 0.1324304 -0.1142514 0.0669389 -0.0788477 -0.0234524 -0.0445295 -0.0192407 -0.0489182 -0.017821 -0.1039187 0.0111527 0.0373884 -0.0221602 -0.0332831 -0.0224008 0.0629866 -0.0792917 -0.0276467 -0.0167397 -0.1197618 0.022788 0.0887341 0.005339 0.0685646 -0.1528857 0.0108754 0.0140673 -0.0215195 0.0767779 -0.1103818 0.0625873 -0.0945619 0.0669387 0.0335176 0.0438525 -0.1327552 0.0639006 -0.0142118 0.0257818 0.0100828 0.0381543 0.0184266 0.005071 -0.069767 0.105089 -0.1015001 -0.1116665 -0.0912867 -0.089062 0.0955192 -0.0677582 0.0166839 0.0608019 0.1192824 0.0876538 -0.0205665 0.047348 0.0030294 -0.0297332 -0.0082646 -0.0114499 -0.0782612 -0.0897949 -0.1208787 -0.1236282 -0.0116162 0.0518847 0.0580623 0.0853349 0.0497158 -0.0853159 0.0972265 -0.0871258 0.0134679 -0.0111701 0.0041058 0.0181208 -0.0045122 0.0671476 0.0681311 -0.0942721 0.0937413 -0.0790392 -0.0201364 0.0000999 0.0083958 -0.103494 -0.1001562 0.0342827 -0.040518 0.0185487 0.0998949 unknown
polarizability: 99.2977061|-1.535679|71.4131161|-2.6739108|2.4150494|67.0739056 unknown
InChI: InChI=1S/C7H12O2/c1-9-7(8)6-4-2-3-5-6/h6H,2-5H2,1H3
charge 0 multiplicity 1
21 atoms
O  2.051262 -0.529747 -0.650615
O  1.421736 0.860833 1.107557
C  -0.30708 -0.161425 -0.340239
C  -1.240901 1.091567 -0.329695
C  -1.030762 -1.177789 0.600525
C  -2.654408 0.578714 0.110099
C  -2.519643 -0.965571 0.242362
C  1.101468 0.140063 0.13324
C  3.464456 -0.346553 -0.239013
H  -0.246713 -0.59838 -1.35252
H  -1.262663 1.570154 -1.324548
H  -0.850692 1.833287 0.3890
H  -0.846795 -0.897306 1.655484
H  -0.681972 -2.214449 0.45015
H  -3.443479 0.863429 -0.608142
H  -2.928279 1.018863 1.086386
H  -3.20357 -1.391317 0.998252
H  -2.744157 -1.456532 -0.724497
H  4.046158 -0.938233 -0.959707
H  3.613942 -0.712999 0.790693
H  3.740793 0.720391 -0.28397
