program: Gaussian 09
title: 000078455
version: EM64L-G09RevD.01
frameworkgroup: C1[X(C8H11NO7S2)]
method: RPBEPBE
basis: SDD
operation: Freq
keyword: #p
keyword: freq=noraman
keyword: PBEPBE/SDD
title: #p freq=noraman PBEPBE/SDD
converged: YES YES NO NO
title: Mulliken charges:
elementType: S S O O O O O O O N C C C C C C C C H H H H H H H H H H H
charge: 0.874137 1.190474 -0.387952 -0.606893 -0.508115 -0.391304 -0.543108 -0.494488 -0.465745 -0.724794 -0.500334 -0.048371 -0.291914 -0.309165 -0.237804 0.144692 -0.307263 0.186543 0.263408 0.287037 0.294008 0.256680 0.307582 0.288182 0.271668 0.323019 0.328169 0.389183 0.412465
chargesum: 0.00000
title: Mulliken charges with hydrogens summed into heavy atoms:
elementType: S S O O O O O O O N C C C C C C C C
charge: 0.874137 1.190474 -0.387952 -0.606893 -0.508115 -0.002120 -0.130644 -0.494488 -0.465745 -0.073606 0.050111 -0.048371 0.258774 -0.001583 0.050378 0.144692 -0.035595 0.186543
polarizability: 2.57153320e+02 -4.09096712e-01 1.65309807e+02 2.23480915e+00 1.43677957e+00 1.11127774e+02
1716.lowfreq: -13.5329 -3.9410 -0.0013 -0.0011 -0.0009 4.8280 23.4872 24.5539 41.0642
frequency: 23.4257 23.9975 40.9752 46.9907 77.2388 92.2995 124.4493 136.3800 151.6224 174.5956 202.5747 211.2538 219.7595 229.3731 253.6376 281.5637 294.8686 296.4334 314.5321 340.8450 348.3983 370.8995 378.3102 408.7920 435.5191 453.2350 466.8864 513.7585 520.5392 566.7692 572.7674 627.0799 640.8891 722.9868 734.8235 754.1374 769.3776 822.4373 833.9933 856.0874 861.0903 863.9301 879.4050 891.8947 902.6618 925.4521 961.1900 972.1372 997.5188 1044.7327 1049.9982 1110.0851 1146.5445 1157.8093 1177.3097 1205.8159 1229.3520 1247.9450 1266.0257 1315.0032 1336.4299 1378.0457 1386.9652 1407.9046 1428.4347 1442.3487 1477.4287 1571.9641 1613.0995 1633.9164 2238.6756 2950.8095 3015.4212 3048.1402 3143.9816 3152.6655 3154.2884 3157.5988 3185.3434 3455.5827 3568.7057
redmass: 10.3398 5.0929 8.6134 7.5978 7.4759 1.7135 6.6597 7.1826 5.9768 3.2352 8.7340 4.3625 5.0521 4.0381 6.2662 4.4872 4.8590 5.7092 6.8326 9.8837 7.3977 4.3373 9.6297 7.0044 2.9925 4.9750 4.8061 5.1809 5.9151 4.5178 5.7940 8.3486 13.7021 3.5999 1.3133 10.8637 5.4663 2.6081 1.4794 7.1872 8.9172 1.0795 1.1557 4.5589 1.3774 1.8319 1.3404 3.1773 15.4580 2.1586 2.8434 1.8547 1.3155 1.1857 1.5027 1.1240 1.8677 1.9035 1.1918 2.3672 1.2329 1.1091 1.0783 3.5607 3.6249 1.0614 3.8533 4.1825 6.7320 1.1991 1.0863 1.0600 1.0998 1.0577 1.1098 1.0782 1.0746 1.0915 1.0960 1.0455 1.0977
irintensity: 0.4223 3.3774 3.0807 1.8859 2.9756 12.2896 12.7137 1.5181 2.3529 1.6459 1.8271 0.6565 3.3366 5.5773 7.3831 14.5445 6.1211 30.5582 12.8304 6.8429 11.2239 20.2727 30.8045 10.2213 10.6383 104.2836 14.1735 44.1285 27.5447 45.3772 22.9934 1.4545 74.4446 4.7980 182.0438 196.4426 25.0592 8.5313 64.2207 66.0021 40.7835 100.9251 108.6274 110.4826 26.5818 57.0553 0.5569 84.9588 134.6096 82.4000 8.8866 3.2293 1.6765 2.3678 78.1788 5.5711 122.1903 113.0148 6.1889 39.8435 8.7045 15.5645 52.4426 51.7967 12.4259 23.9966 161.0966 65.8829 5.0036 49.4980 2940.9098 17.3145 3.3568 7.9095 0.3249 60.6807 116.9250 20.0067 2.3902 14.0480 22.2789
temp: 298.150 k
press: 1.00000 atm
elementType: 16 16 8 8 8 8 8 8 8 7 6 6 6 6 6 6 6 6 1 1 1 1 1 1 1 1 1 1 1
symmnumber: 1
zpe: 510136.5 jmol-1
zpe.correction: 0.194301 hartree
zpe.thermalcorrener: 0.213942 hartree
zpe.thermalcorrenthalpy: 0.214886 hartree
zpe.thermalcorrgfe: 0.144523 hartree
zpe.sumelectzpe: -1687.156649 hartree
zpe.sumelectthermal: -1687.137007 hartree
zpe.sumelectthermalent: -1687.136063 hartree
zpe.sumelectthermalfe: -1687.206426 hartree
dipole: 10.0066 0.2902 4.7128
dipole: 11.0647
quadrupole: -147.9354 -112.2792 -122.6905
quadrupole: 21.9248 -3.5370 -6.6434
quadrupole: -20.3004 15.3558 4.9446 21.9248 -3.5370 -6.6434
hfenergy: -1687.3509494 hartree
pointgroup: C01 [X(C8H11N1O7S2)]
dipole: -3.9829971 -0.270559 1.7357182 debye
polarizability: 257.1646008|-1.1100127|165.0326928|1.3259748|4.186797|111.3936072 unknown
InChI: InChI=1S/C8H11NO7S2/c9-7-5-6(1-2-8(7)10)17(11,12)4-3-16-18(13,14)15/h1-2,5,10,13H,3-4,9H2
charge 0 multiplicity 1
29 atoms
S  0.40804 0.568703 -0.27789
S  4.364291 -0.601645 -0.102083
O  3.245333 -0.451431 1.45122
O  0.951015 -0.864045 -0.933517
O  0.741514 1.99892 -0.983229
O  -5.551385 -0.184942 -0.006529
O  3.35261 -1.628695 -1.084075
O  4.487471 0.894331 -0.698659
O  5.644153 -1.437342 0.348729
N  -4.073812 -2.394434 -0.09806
C  1.072397 0.678935 1.559159
C  -1.443596 0.327479 -0.162947
C  2.588138 0.849835 1.597264
C  -1.950964 -0.98559 -0.156567
C  -2.248735 1.483696 -0.158559
C  -3.34829 -1.138818 -0.106126
C  -3.647269 1.325825 -0.1030
C  -4.191285 0.019544 -0.066775
H  0.530728 1.556745 1.95001
H  0.734227 -0.258524 2.027237
H  2.945915 1.574335 0.832979
H  2.868293 1.247675 2.593049
H  -1.27697 -1.845706 -0.227706
H  -1.794673 2.477902 -0.227852
H  -4.31741 2.189037 -0.095198
H  -3.888012 -3.005309 0.704098
H  -4.0603 -2.910822 -0.984744
H  -5.644982 -1.19748 0.010798
H  2.340958 -1.260278 -1.052426
