program: Gaussian 09
title: 000078361
version: EM64L-G09RevD.01
frameworkgroup: C1[X(C6H15NO)]
method: RPBEPBE
basis: SDD
operation: Freq
keyword: #p
keyword: freq=noraman
keyword: PBEPBE/SDD
title: #p freq=noraman PBEPBE/SDD
converged: YES YES NO NO
title: Mulliken charges:
elementType: O N C C C C C C H H H H H H H H H H H H H H H
charge: -0.460713 -0.334352 0.279578 -0.723140 -0.697785 -0.702447 -0.353109 -0.331499 0.236128 0.233555 0.207217 0.199835 0.209337 0.230376 0.205791 0.203994 0.210205 0.226202 0.225677 0.205629 0.175549 0.208844 0.345126
chargesum: 0.00000
title: Mulliken charges with hydrogens summed into heavy atoms:
elementType: O N C C C C C C
charge: -0.115586 -0.098224 0.279578 -0.082532 -0.052281 -0.062046 0.078197 0.052894
polarizability: 9.23409872e+01 -3.87052586e-01 7.15741249e+01 -3.94997578e-01 -6.67864578e-01 6.85044950e+01
1716.lowfreq: -19.8735 -11.4426 -0.0007 0.0005 0.0007 9.1076 44.2085 62.0439 110.4826
frequency: 43.1379 61.9299 110.4701 154.3292 202.9027 246.8864 252.5492 255.7975 284.2474 299.1481 331.5626 371.8928 435.1663 467.5227 502.7601 655.5743 742.5813 825.8119 890.9831 905.8493 923.2954 938.8725 982.2836 1005.2656 1014.1250 1032.7929 1093.3792 1116.9196 1171.1465 1206.0907 1214.4819 1240.9847 1266.5009 1279.1002 1337.3001 1367.2265 1371.9782 1393.8406 1410.3170 1446.8391 1456.7798 1461.3961 1465.2397 1475.9224 1478.3874 1486.7221 1488.5120 1498.4829 2909.3089 2929.0359 2966.6975 2971.5751 2982.8055 3004.4127 3060.1009 3061.8211 3067.5304 3069.5497 3077.2896 3087.3654 3093.5979 3412.1377 3575.3055
redmass: 1.8246 3.4085 3.2539 1.6918 1.3173 1.0459 1.0873 1.0939 2.7005 3.1465 2.3207 2.5525 2.2177 2.5866 2.9134 1.5470 3.1680 1.1459 1.8618 2.0212 1.5841 1.2157 5.6041 1.8495 1.3953 1.6215 1.7288 2.6918 1.1969 1.5521 2.0227 2.7065 2.1950 1.2075 1.3172 1.2072 1.2382 1.2148 1.4774 1.1240 1.0882 1.0498 1.0522 1.0691 1.0594 1.1072 1.0860 1.0695 1.0705 1.0614 1.0353 1.0366 1.0356 1.0982 1.0983 1.0933 1.0970 1.0994 1.0979 1.1005 1.0997 1.0735 1.0665
irintensity: 4.7009 0.7156 6.9699 6.7352 4.1515 0.3297 45.2561 114.8354 4.3920 2.6383 0.7351 5.8868 8.2508 1.5597 14.8207 100.7051 2.7321 0.5452 0.3677 6.5797 0.8172 0.1294 78.8819 27.4298 1.9030 5.2133 2.9061 23.7101 12.6516 49.7122 46.5881 31.6592 24.0306 3.3333 1.8821 30.4129 27.8777 18.2992 0.8241 14.4293 4.5792 0.3312 1.5583 1.7816 9.1485 7.2717 3.4887 17.0441 63.0723 70.8918 29.9671 40.5661 14.9342 55.1514 1.9433 14.3566 93.1267 11.2147 74.4570 6.1424 66.6352 4.2259 3.0548
temp: 298.150 k
press: 1.00000 atm
elementType: 8 7 6 6 6 6 6 6 1 1 1 1 1 1 1 1 1 1 1 1 1 1 1
symmnumber: 1
zpe: 537923.7 jmol-1
zpe.correction: 0.204884 hartree
zpe.thermalcorrener: 0.215942 hartree
zpe.thermalcorrenthalpy: 0.216886 hartree
zpe.thermalcorrgfe: 0.168570 hartree
zpe.sumelectzpe: -366.892977 hartree
zpe.sumelectthermal: -366.881920 hartree
zpe.sumelectthermalent: -366.880975 hartree
zpe.sumelectthermalfe: -366.929291 hartree
dipole: 0.1822 1.3054 -0.4993
dipole: 1.4095
quadrupole: -46.7223 -53.3325 -51.5183
quadrupole: -6.7415 -1.1591 -1.7184
quadrupole: 3.8021 -2.8082 -0.9939 -6.7415 -1.1591 -1.7184
hfenergy: -367.0978616 hartree
pointgroup: C01 [X(C6H15N1O1)]
dipole: -0.0931597 0.5326602 0.1228876 debye
dipolederiv: -0.8039928 0.24707 -0.0585971 0.3164238 -0.3203768 -0.1079286 -0.0834123 -0.0991289 -0.5520169 -0.7956787 -0.0719103 0.0067268 -0.0321432 -0.4698177 0.2123958 0.0223657 0.2340951 -0.34708 0.6165324 0.1569207 -0.0026817 0.2311314 0.3366533 -0.0771094 0.1106238 -0.0597461 0.3606657 -0.0745755 0.0590099 -0.0064803 0.0663537 -0.037284 0.0173304 0.0105186 0.0225526 0.0534669 0.0011073 -0.0089204 -0.0014955 -0.0533213 -0.0117867 -0.0607144 -0.0221465 -0.0649092 -0.1066522 -0.066514 -0.0225895 0.0147462 -0.097346 -0.0852207 0.1120369 0.0478432 0.13281 -0.0933871 0.3461524 -0.1162132 0.0553827 -0.2525024 0.1791444 -0.0917315 -0.0517886 -0.069425 0.3044969 0.6702782 -0.1823165 0.0323139 -0.1954226 0.3414799 0.0640134 0.0109907 0.0836788 0.3973519 0.0986731 0.0124645 -0.0094152 0.0267442 0.1674793 -0.115529 -0.0324261 -0.2244447 0.0330077 0.100525 -0.0255713 0.0377613 0.0094563 -0.0251745 0.1089842 0.0029456 0.1408822 -0.0522844 -0.1563885 -0.0559537 -0.0112992 -0.1147581 0.0404723 -0.0115171 -0.0150056 -0.0098002 0.0955991 0.0796126 -0.016664 -0.0436287 0.0208586 0.000932 -0.1076004 -0.0031562 -0.1476932 -0.1257457 -0.0066556 0.1514658 0.0327826 0.1437766 -0.0686167 -0.0291719 0.0012644 -0.0011687 0.0671265 0.099953 -0.026046 0.0520387 -0.0214275 -0.0024242 0.137323 0.0366795 0.0853238 -0.0733652 -0.1583491 -0.1037002 -0.0572274 -0.0784474 0.064928 -0.0224857 -0.0092128 -0.0102284 0.0787808 0.0932735 -0.0138027 -0.0117981 0.000917 0.0092667 -0.1315297 -0.0028378 -0.0732364 -0.1446496 -0.1542132 -0.1282503 0.0062824 -0.1217898 0.0331326 0.0108132 -0.0178583 -0.0087763 0.0779022 -0.0191753 0.1512417 -0.0199071 0.1334055 -0.0491573 0.0213974 0.0075269 0.000113 0.0676229 0.0896261 -0.0157859 -0.0278683 0.0057653 -0.0503651 -0.0918244 -0.0089563 -0.0998145 -0.0311787 -0.0397381 0.0407672 -0.0175635 0.0863572 -0.0446158 0.1192647 -0.0741255 0.143545 -0.1474766 -0.0353589 0.0386244 -0.007887 0.0377674 -0.148712 -0.1244836 -0.0004212 -0.1714436 -0.074418 -0.0034204 0.0435316 -0.0162714 0.0467134 -0.0187293 0.0900586 0.0000736 0.1218155 -0.1579777 0.1183262 -0.1133717 0.0540855 -0.1585122 0.1587924 0.0780079 0.0705153 0.0749991 0.3702114 unknown
polarizability: 92.2745681|1.1770415|71.7612216|-0.5581946|0.19173|68.3838175 unknown
InChI: InChI=1S/C6H15NO/c1-6(2,3)7-4-5-8/h7-8H,4-5H2,1-3H3
charge 0 multiplicity 1
23 atoms
O  3.578738 -0.226851 0.054659
N  -0.047414 0.607478 0.11498
C  -1.379136 -0.074729 0.025349
C  -2.443106 1.0495 0.07244
C  -1.487045 -0.818668 -1.329638
C  -1.623459 -1.073744 1.197136
C  1.171994 -0.22832 0.175595
C  2.401968 0.649275 -0.084961
H  -0.057804 1.297922 0.880669
H  -2.290621 1.754563 -0.763687
H  -3.462124 0.628731 0.002434
H  -2.37745 1.618422 1.021018
H  -0.798048 -1.6811 -1.385177
H  -1.24773 -0.128479 -2.157506
H  -2.512872 -1.204752 -1.472071
H  -1.588317 -0.550505 2.172015
H  -2.613424 -1.558281 1.104189
H  -0.857711 -1.871013 1.207079
H  1.123955 -0.997843 -0.613973
H  1.321129 -0.760404 1.143762
H  2.441361 1.481119 0.654253
H  2.33222 1.087553 -1.10125
H  4.397194 0.283825 -0.165916
