program: Gaussian 09
title: 000078359
version: EM64L-G09RevD.01
frameworkgroup: C1[X(C2H6Cl4OSi2)]
method: RPBEPBE
basis: SDD
operation: Freq
keyword: #p
keyword: freq=noraman
keyword: PBEPBE/SDD
title: #p freq=noraman PBEPBE/SDD
converged: NO NO NO NO
title: Mulliken charges:
elementType: Cl Cl Cl Cl Si Si O C C H H H H H H
charge: -0.276917 -0.277819 -0.276881 -0.277848 1.195601 1.195597 -0.939512 -1.003842 -1.003856 0.277326 0.277568 0.277847 0.277826 0.277322 0.277588
chargesum: 0.00000
title: Mulliken charges with hydrogens summed into heavy atoms:
elementType: Cl Cl Cl Cl Si Si O C C
charge: -0.276917 -0.277819 -0.276881 -0.277848 1.195601 1.195597 -0.939512 -0.171101 -0.171120
polarizability: 1.00342672e+02 1.18730971e-02 1.15535770e+02 6.64236808e+00 7.62411781e-04 9.38730476e+01
1716.lowfreq: -9.3446 0.0034 0.0036 0.0044 3.6751 6.9621 9.8473 19.4011 26.5242
frequency: 6.9532 18.3354 25.8584 108.8460 112.6200 145.1892 146.2399 162.6558 176.4867 177.8037 193.7755 203.1845 211.4378 284.9723 295.2679 360.2495 416.7073 487.7772 508.6440 565.6688 743.7560 756.4595 886.2200 889.7609 892.1449 906.1639 1112.5175 1334.1414 1334.4401 1427.3174 1427.7028 1435.1347 1435.3015 3006.5320 3006.5927 3114.9343 3115.0415 3125.5233 3125.5789
redmass: 11.3621 17.2940 5.6127 31.1529 9.2793 3.5652 13.8853 3.3471 1.0239 1.0424 4.1000 7.8777 4.7891 13.0357 12.2179 10.9141 10.6168 13.8780 11.5603 7.8539 6.2279 6.4065 1.3313 1.3226 1.3530 1.4070 17.0060 1.1844 1.1844 1.0474 1.0468 1.0465 1.0465 1.0342 1.0342 1.0994 1.0994 1.0993 1.0992
irintensity: 1.8127 0.2778 4.6458 0.0009 0.0116 0.0051 4.9044 0.0059 0.0043 0.0056 0.0035 0.0016 30.4013 13.3815 56.2142 0.2942 123.0783 0.8092 259.5876 0.0235 114.9881 0.1749 0.3176 142.8115 180.4801 0.0660 924.7806 61.2163 0.1221 23.5359 0.1179 0.2948 16.7683 0.2567 0.1208 1.1597 1.2575 0.4571 2.3393
temp: 298.150 k
press: 1.00000 atm
elementType: 17 17 17 17 14 14 8 6 6 1 1 1 1 1 1
symmnumber: 1
zpe: 225400.0 jmol-1
zpe.correction: 0.085850 hartree
zpe.thermalcorrener: 0.100236 hartree
zpe.thermalcorrenthalpy: 0.101180 hartree
zpe.thermalcorrgfe: 0.039353 hartree
zpe.sumelectzpe: -2573.568762 hartree
zpe.sumelectthermal: -2573.554377 hartree
zpe.sumelectthermalent: -2573.553432 hartree
zpe.sumelectthermalfe: -2573.615260 hartree
dipole: -0.0016 0.1734 0.0010
dipole: 0.1734
quadrupole: -103.8532 -105.9779 -88.7740
quadrupole: -0.0055 -13.8294 0.0012
quadrupole: -4.3182 -6.4429 10.7611 -0.0055 -13.8294 0.0012
hfenergy: -2573.6546123 hartree
pointgroup: C01 [X(C2H6Cl4O1Si2)]
dipole: -0.0007035 0.0007363 0.0681987 debye
dipolederiv: -0.4601418 0.0497661 -0.1174224 0.0748397 -0.4632694 0.170138 -0.1777819 0.1872134 -0.6871365 -0.4617061 0.0580611 0.111751 0.0873377 -0.4968062 -0.1853665 0.1692491 -0.2053223 -0.6583958 -0.4600878 0.0532005 0.1159094 0.0800704 -0.4739421 -0.1764067 0.1755029 -0.1934611 -0.6764551 -0.4617868 0.0548968 -0.1136349 0.0823786 -0.4854424 0.1802256 -0.1718205 0.2001857 -0.6697131 2.6285757 -0.1902122 0.0057887 -0.0504659 1.6245995 0.017383 0.0097498 0.0152947 1.9949376 2.6286174 -0.190255 0.0000031 -0.050888 1.6239113 -0.0064529 -0.0081769 -0.0044037 1.9954857 -2.9399582 0.0678946 -0.0009521 -0.2124288 -0.9046916 0.0009635 0.0031413 0.0009541 -0.8376647 -0.4237376 0.0417371 -0.0036709 -0.0417338 -0.4021173 -0.0004147 0.0044349 0.0059202 -0.3882592 -0.4236979 0.0419318 0.0024505 -0.0419224 -0.4023016 0.0009216 -0.0031761 -0.0053815 -0.3881122 0.1235527 0.0085562 0.0295377 0.0470539 0.029689 -0.1054007 0.0476326 -0.0475597 0.022605 0.1185013 0.0060213 -0.0351056 0.0479658 0.0430783 0.1006487 -0.0580914 0.0435848 0.0131769 -0.0550577 -0.0080766 0.0051062 -0.0586816 0.117134 0.0007417 0.006815 0.0001253 0.1219765 -0.0550997 -0.0083103 -0.004812 -0.0588885 0.1171045 -0.0006324 -0.0050061 -0.0000361 0.1219937 0.1235143 0.0077379 -0.0298613 0.0457205 0.0341758 0.1050509 -0.0490731 0.0471982 0.0180374 0.1185123 0.0070509 0.0349126 0.0496424 0.0388784 -0.1013991 0.0566005 -0.0443119 0.0175238 unknown
polarizability: 98.1323596|-7.3158411|96.0875073|0.1184735|0.2840701|115.5316225 unknown
InChI: InChI=1S/C2H6Cl4OSi2/c1-8(3,4)7-9(2,5)6/h1-2H3
charge 0 multiplicity 1
15 atoms
Cl -2.384442 0.902278 -1.348081
Cl -2.376076 1.046537 2.182466
Cl 2.385128 -0.941614 -1.320888
Cl 2.377782 -0.981844 2.212303
Si -1.669913 -0.095247 0.462893
Si 1.670598 0.108658 0.459828
O  0.000349 0.006706 0.46136
C  -2.285063 -1.862751 0.55457
C  2.28505 1.878296 0.499443
H  -1.939226 -2.429595 -0.326211
H  -1.891761 -2.345694 1.466085
H  -3.386494 -1.893548 0.586549
H  3.386477 1.910338 0.529888
H  1.938833 2.418784 -0.397616
H  1.891659 2.387898 1.39631
