program: Gaussian 09
title: 000078481
version: EM64L-G09RevD.01
frameworkgroup: C1[X(C9H18O6)]
method: RPBEPBE
basis: SDD
operation: Freq
keyword: #pfreq=noraman
keyword: PBEPBE/SDD
title: #p freq=noraman PBEPBE/SDD
converged: YES YES NO NO
title: Mulliken charges:
elementType: O O O O O O C C C C C C C C C H H H H H H H H H H H H H H H H H H
charge: -0.257200 -0.514472 -0.470214 -0.513322 -0.445103 -0.458659 0.286416 0.172687 -0.097331 -0.448231 -0.437376 -0.420110 -0.448858 -0.372913 -0.350125 0.184030 0.255133 0.198628 0.208064 0.256648 0.236802 0.219649 0.281500 0.237909 0.174299 0.211598 0.240002 0.198544 0.375041 0.387963 0.371049 0.376980 0.360974
chargesum: 0.00000
title: Mulliken charges with hydrogens summed into heavy atoms:
elementType: O O O O O O C C C C C C C C C
charge: -0.257200 -0.139431 -0.082251 -0.142272 -0.068123 -0.097685 0.286416 0.172687 0.086699 0.005529 0.027336 0.036341 0.070551 0.012983 0.088421
polarizability: 1.29667425e+02 1.43206270e+00 1.06282558e+02 -1.59581920e+00 1.70287039e+00 1.06148118e+02
1716.lowfreq: -17.3466 -8.3526 0.0005 0.0007 0.0008 5.9201 60.8382 87.4220 111.3564
frequency: 60.7343 87.4018 111.3302 132.8078 145.1829 174.6503 196.3759 224.7522 233.9188 259.1083 281.9400 302.2278 320.3493 326.7869 343.0262 346.1402 358.5095 380.2229 409.5275 434.0083 467.0822 486.7560 502.2007 588.7183 601.8350 638.6521 667.4832 690.8040 755.8396 788.3948 844.8840 864.8263 884.1350 915.4577 918.6149 929.8810 947.2844 955.6024 970.7819 972.3432 985.8647 1002.9808 1020.1190 1036.6322 1065.3957 1096.2131 1123.8499 1137.4278 1144.3534 1155.1500 1190.2630 1200.9077 1215.3538 1236.2416 1262.9695 1272.9716 1295.7396 1318.3077 1321.2014 1333.6143 1341.4858 1348.3223 1361.5162 1365.2377 1388.4098 1403.7587 1419.6137 1427.4860 1434.6383 1442.5205 1456.6423 1461.1094 1469.0226 1471.5232 1481.6752 2874.1156 2905.1481 2943.4581 2947.9207 2956.2393 3009.1279 3031.1110 3031.5700 3071.9323 3076.1408 3081.2722 3090.6295 3100.5024 3186.8089 3326.0778 3344.1394 3421.8838 3599.5529
redmass: 5.1997 4.8671 3.0458 4.6917 6.4751 5.2438 3.5276 4.0300 3.6340 3.7254 2.9137 2.7165 2.5456 2.4318 2.3983 4.3347 4.9953 2.1831 2.6428 3.1621 2.8805 2.8169 1.2661 3.2252 3.6976 1.8013 1.7195 1.1371 3.3051 3.0470 5.0701 1.6846 1.6934 3.5270 2.0697 2.0617 1.8124 3.2941 2.0403 2.1664 5.5297 3.9217 5.7995 3.8481 2.8980 3.3160 2.2204 1.8542 2.3527 1.7110 1.1342 1.2838 1.1510 1.4238 1.1791 1.3775 1.2361 1.2863 1.1976 1.2406 1.2417 1.3448 1.3062 1.2679 1.1918 1.2170 1.2849 1.2500 1.2155 1.0752 1.0775 1.0841 1.0874 1.0910 1.1029 1.0818 1.0697 1.0676 1.0669 1.0711 1.0583 1.0688 1.0809 1.0966 1.1020 1.1026 1.0933 1.1089 1.0670 1.0640 1.0661 1.0666 1.0666
irintensity: 0.4033 3.4753 1.7811 7.1107 18.8502 7.7384 22.1418 6.9568 4.2890 11.2442 9.0203 4.4508 6.6918 57.0464 33.3313 1.6532 4.1619 55.2422 5.0683 9.1393 4.0269 16.7092 190.2172 5.9773 6.6596 35.0140 102.1997 195.4568 20.4381 38.0414 30.5670 77.6946 86.7619 23.8474 15.8673 26.9506 24.5001 45.5686 18.7556 4.1641 72.4054 72.0370 20.6313 9.2983 42.8458 43.2426 25.4753 12.1251 38.0418 7.5660 43.0325 26.6260 4.3133 17.6098 0.5471 14.7260 17.3203 14.6997 8.9050 1.4246 2.9654 13.9113 13.2604 11.0115 39.5008 28.6482 15.6555 2.1218 183.2468 11.3784 6.8395 6.4989 33.5825 0.3521 13.2582 29.0701 80.2831 39.8468 92.1855 70.4387 55.2532 8.5744 57.8903 24.2819 3.9245 40.1394 15.9909 14.5291 344.3780 130.1046 110.4450 74.8159 17.1963
temp: 298.150 k
press: 1.00000 atm
elementType: 8 8 8 8 8 8 6 6 6 6 6 6 6 6 6 1 1 1 1 1 1 1 1 1 1 1 1 1 1 1 1 1 1
symmnumber: 1
zpe: 724977.2 jmol-1
zpe.correction: 0.276129 hartree
zpe.thermalcorrener: 0.291495 hartree
zpe.thermalcorrenthalpy: 0.292439 hartree
zpe.thermalcorrgfe: 0.235448 hartree
zpe.sumelectzpe: -803.803567 hartree
zpe.sumelectthermal: -803.788202 hartree
zpe.sumelectthermalent: -803.787257 hartree
zpe.sumelectthermalfe: -803.844249 hartree
dipole: -3.2378 -2.5299 -2.1006
dipole: 4.6148
quadrupole: -92.6282 -103.7489 -87.0094
quadrupole: -2.6779 -11.3341 2.4002
quadrupole: 1.8340 -9.2867 7.4527 -2.6779 -11.3341 2.4002
hfenergy: -804.0796966 hartree
pointgroup: C01 [X(C9H18O6)]
dipole: -1.4345561 -0.81235 -0.7606493 debye
polarizability: 128.62962|1.6047641|105.6328385|-5.0325477|1.3848283|107.8356424 unknown
InChI: InChI=1S/C9H18O6/c10-1-8(2-11)5-15-6-9(3-12,4-13)7(8)14/h7,10-14H,1-6H2
charge 0 multiplicity 1
33 atoms
O  0.052639 -1.888655 -1.206586
O  0.073567 1.834277 0.790374
O  -2.614956 1.990308 0.483876
O  -2.902485 -0.28304 1.730073
O  2.735467 2.074056 0.282396
O  1.097508 -1.806708 1.38471
C  -1.304118 -0.03301 -0.163795
C  1.362332 0.063076 -0.338669
C  0.005322 0.823583 -0.272284
C  -1.221463 -1.142422 -1.247717
C  1.210216 -0.993121 -1.460652
C  -2.48593 0.91958 -0.530074
C  -1.517647 -0.622062 1.266319
C  2.452411 1.099311 -0.763812
C  1.842122 -0.606061 0.982505
H  -0.07693 1.348864 -1.256557
H  -2.00527 -1.904097 -1.102696
H  -1.333643 -0.698428 -2.26198
H  1.078731 -0.506022 -2.451794
H  2.084005 -1.66534 -1.506072
H  -3.43711 0.361688 -0.605707
H  -2.284181 1.433135 -1.486149
H  -0.786395 -0.198435 1.973506
H  -1.404025 -1.718246 1.264015
H  2.122412 1.602476 -1.703254
H  3.411254 0.586905 -0.966876
H  1.762932 0.106056 1.818823
H  2.915526 -0.863579 0.856044
H  -0.850651 2.241726 0.84669
H  -2.976601 1.500442 1.284036
H  -3.050932 -0.692966 2.61669
H  1.848253 2.363057 0.651013
H  0.772442 -2.27155 0.564103
