program: Gaussian 09
title: 000078354
version: EM64L-G09RevD.01
frameworkgroup: C1[X(C9H11NO2)]
method: RPBEPBE
basis: SDD
operation: Freq
keyword: #p
keyword: freq=noraman
keyword: PBEPBE/SDD
title: #p freq=noraman PBEPBE/SDD
converged: YES YES NO NO
title: Mulliken charges:
elementType: O O N C C C C C C C C C H H H H H H H H H H H
charge: -0.506722 -0.302380 -0.395331 0.108243 -0.347201 0.178218 0.247025 -0.314054 -0.652137 -0.389860 -0.249340 -0.200704 0.251921 0.206741 0.365696 0.285536 0.203431 0.243823 0.212118 0.215455 0.234068 0.231584 0.373871
chargesum: 0.00000
title: Mulliken charges with hydrogens summed into heavy atoms:
elementType: O O N C C C C C C C C C
charge: -0.132851 -0.302380 -0.029635 0.108243 0.111461 0.178218 0.247025 -0.028518 0.007235 -0.174405 -0.015272 0.030880
polarizability: 1.57375280e+02 3.98396432e+00 1.19047525e+02 -5.76302949e+00 -1.23207166e+00 5.70594128e+01
1716.lowfreq: -18.0119 -7.5421 -3.0738 -0.0008 -0.0006 -0.0005 15.2471 52.8678 82.3445
frequency: 7.5646 52.8557 82.3227 143.1474 167.5917 234.8597 249.2829 314.6685 322.6129 329.8622 369.3106 420.4682 458.3563 514.7431 527.3358 543.0328 641.0935 671.2431 711.6856 740.0785 752.5755 766.5850 802.0668 851.8614 855.6493 892.7645 957.3314 1001.7758 1025.4074 1047.6664 1072.9971 1089.5035 1149.9453 1153.4934 1158.7141 1171.1967 1215.7754 1281.7256 1290.1480 1294.8432 1354.6529 1382.5882 1390.9366 1431.6003 1456.2629 1468.6251 1478.0407 1481.1300 1534.5486 1573.6358 1611.1966 1618.6357 2982.7205 3002.7939 3067.5075 3083.5100 3100.2255 3109.8867 3140.8492 3153.3727 3170.6192 3461.7726 3595.4914
redmass: 2.6020 5.4882 4.2113 4.6071 2.1076 1.4532 3.4106 5.2325 3.0912 1.2063 6.4362 3.3965 3.2430 4.4377 3.7976 7.2132 5.5627 4.1167 1.1264 1.8083 2.6137 1.7622 2.8743 2.8162 1.4402 2.1951 1.3484 1.3310 3.4445 2.3082 2.5905 1.9002 1.4642 1.7365 2.0899 1.0650 2.8683 2.5218 1.4830 1.1447 1.2789 1.2125 7.5339 2.4164 1.1188 1.0554 2.3164 1.0588 1.8228 6.1068 5.9510 5.9983 1.0354 1.0632 1.0998 1.0985 1.1022 1.0890 1.0879 1.0929 1.1002 1.0803 1.0661
irintensity: 0.6231 5.6149 0.2234 0.3503 3.2938 4.8916 7.1579 2.1381 9.8411 129.7172 10.9889 4.3753 4.3336 7.9014 15.3145 4.5507 2.7057 31.6744 89.5747 9.4713 68.7896 42.8992 5.4492 27.1616 0.1625 9.7647 2.2017 1.2841 4.6682 16.6729 71.9447 18.6184 20.3388 54.0020 7.1037 8.5708 22.6148 84.2983 70.5017 16.8569 4.3513 16.0996 9.3837 22.1499 38.2949 22.4458 46.2916 10.8661 250.6771 51.6567 76.6772 89.4929 35.1583 53.5960 7.1746 47.0635 33.3009 13.4769 9.5231 3.1109 25.4061 104.2664 38.6238
temp: 298.150 k
press: 1.00000 atm
elementType: 8 8 7 6 6 6 6 6 6 6 6 6 1 1 1 1 1 1 1 1 1 1 1
symmnumber: 1
zpe: 484396.3 jmol-1
zpe.correction: 0.184497 hartree
zpe.thermalcorrener: 0.196105 hartree
zpe.thermalcorrenthalpy: 0.197049 hartree
zpe.thermalcorrgfe: 0.144865 hartree
zpe.sumelectzpe: -553.884591 hartree
zpe.sumelectthermal: -553.872983 hartree
zpe.sumelectthermalent: -553.872039 hartree
zpe.sumelectthermalfe: -553.924222 hartree
dipole: -2.0350 4.9450 0.1698
dipole: 5.3501
quadrupole: -58.5497 -65.0977 -74.6660
quadrupole: 1.9404 -1.3154 -1.2179
quadrupole: 7.5548 1.0067 -8.5615 1.9404 -1.3154 -1.2179
hfenergy: -554.0690876 hartree
pointgroup: C01 [X(C9H11N1O2)]
dipole: -0.8947997 -0.2625213 -1.8870497 debye
dipolederiv: -0.46117 0.1197134 0.475667 0.0937109 -0.4852629 -0.2099508 0.378123 -0.2009823 -0.966332 -0.7735851 0.0076516 -0.235454 0.0688388 -0.3951956 -0.093749 0.0123853 -0.1018679 -0.942459 -1.0796083 0.0536302 0.2729026 0.1395784 -0.5378016 -0.1170454 0.3070883 -0.0583004 -0.6266135 -0.4310038 0.0339054 -0.1272642 0.0701977 -0.0327035 -0.0297977 0.0347954 -0.0595942 -0.2391956 0.6752395 -0.010257 -0.112824 -0.0553815 0.3210172 0.0544568 0.0993951 -0.024453 0.1071767 1.5111175 -0.179992 0.0461253 -0.2717322 0.2827346 0.2305716 -0.2813781 0.2266982 1.1948514 0.3339471 -0.1595172 -0.4661236 -0.1038266 0.1456373 0.2593883 -0.2672978 0.2339431 0.8368112 0.1174068 -0.0174976 0.0861164 -0.0667392 -0.0803697 0.0156331 -0.1235543 0.0468771 0.0327299 -0.0761041 -0.0376872 0.0523955 -0.0308258 -0.0795521 -0.0032798 0.0057727 0.032052 0.0888649 -0.2168377 0.0724928 0.2907245 0.0141574 -0.2036559 -0.0196816 0.0421247 0.0211303 -0.0698211 -0.1813879 -0.0419416 -0.1581901 -0.0452567 -0.1696164 0.0615032 -0.1835671 0.0630446 -0.0437874 0.0831893 -0.0431592 -0.0157397 -0.0128015 -0.1092289 0.0678619 0.0986241 0.0511111 0.1487585 0.0583937 -0.0162722 0.0282026 -0.0306036 0.0723838 0.0287155 -0.0944625 0.0885276 -0.0413117 -0.0583818 0.0306275 0.0396882 0.0666461 -0.1182973 -0.0962613 0.0629249 -0.1345983 0.0387475 0.3104147 0.0288563 0.0804866 0.0452621 0.3281547 -0.0153614 0.0722769 -0.0256636 0.2307325 0.1637738 -0.0141425 -0.0631998 -0.0067992 0.147365 -0.0165565 -0.0236712 -0.0238352 0.0364049 0.0952042 -0.0058598 -0.0640608 -0.021037 0.0535776 0.0393374 -0.0077564 0.0784634 -0.1597736 0.1026799 0.0599275 0.0444343 0.0250488 -0.0652833 -0.0662024 0.0271346 -0.1014272 0.0268551 -0.2496744 0.0283507 -0.0068046 0.013508 0.0825879 0.030424 -0.0322188 0.0163326 0.0925852 0.0511006 0.0104641 -0.0398199 0.0013932 0.1582262 -0.0600656 -0.0801409 -0.0547513 -0.113076 0.0064701 0.0446122 0.0794177 0.0495102 0.1461122 -0.0594769 0.094457 -0.0612709 -0.0269873 -0.1151598 0.0392976 -0.0259764 0.0385768 0.1493276 -0.0106679 -0.0345142 -0.0093891 0.0940642 0.1339756 -0.003203 -0.1807038 0.0185748 0.3898429 0.0102046 -0.1065408 -0.0020467 0.300775 unknown
polarizability: 155.7415994|-12.8702297|61.4257504|-3.3182795|13.8789188|116.3148679 unknown
InChI: InChI=1S/C9H11NO2/c1-2-10-9(12)7-5-3-4-6-8(7)11/h3-6,10-11H,2H2,1H3
charge 0 multiplicity 1
23 atoms
O  -0.32719 -0.419905 -1.92583
O  1.411197 0.205917 1.937235
N  1.798312 -0.416144 -0.271578
C  -0.498824 0.1640 0.441384
C  3.245322 -0.593369 -0.073749
C  0.973834 -0.010822 0.757992
C  -1.124496 -0.026613 -0.822273
C  -1.326702 0.559678 1.524082
C  4.062868 0.651298 -0.487452
C  -2.51488 0.16936 -0.992073
C  -2.712417 0.758317 1.371612
C  -3.309963 0.561447 0.104649
H  3.40462 -0.801643 0.997924
H  3.57255 -1.477995 -0.652323
H  1.380408 -0.548127 -1.199429
H  -0.825671 0.701976 2.487563
H  3.913288 0.895638 -1.55517
H  3.758275 1.523452 0.116126
H  5.141808 0.47411 -0.321841
H  -2.973733 0.016082 -1.978153
H  -3.322155 1.063056 2.227919
H  -4.386175 0.71148 -0.033058
H  -0.873477 -0.521893 -2.742654
