program: Gaussian 09
title: 000078460
version: EM64L-G09RevD.01
frameworkgroup: C1[X(C12H14NO3S)]
method: RPBEPBE
basis: SDD
operation: Freq
keyword: #p
keyword: freq=noraman
keyword: PBEPBE/SDD
title: #p freq=noraman PBEPBE/SDD
converged: YES YES NO NO
title: Mulliken charges:
elementType: S O O O N C C C C C C C C C C C C H H H H H H H H H H H H H H
charge: 1.056378 -0.584847 -0.529978 -0.459895 -0.125585 -0.426350 -0.385001 -0.600399 0.257684 0.360528 -0.165545 -0.301497 -0.256021 -0.183447 -0.356854 -0.229425 -0.222848 0.314185 0.250317 0.262272 0.294255 0.327138 0.316582 0.277526 0.332762 0.284822 0.274872 0.267575 0.274609 0.271639 0.404549
chargesum: 1.00000
title: Mulliken charges with hydrogens summed into heavy atoms:
elementType: S O O O N C C C C C C C C C C C C
charge: 1.056378 -0.180298 -0.529978 -0.459895 -0.125585 0.138151 0.171526 0.043321 0.257684 0.360528 0.111981 0.031264 0.028801 0.091425 -0.089279 0.045184 0.048790
polarizability: 2.13245512e+02 9.21650494e-01 1.99722145e+02 4.33767107e+00 -2.06845901e+00 9.51584134e+01
1716.lowfreq: -12.8460 -8.7545 -2.1437 0.0012 0.0015 0.0019 32.0221 46.3863 66.5331
frequency: 31.9877 46.3141 66.4959 76.9697 109.8858 158.8201 171.3490 180.6201 202.0998 229.0265 270.6585 279.0774 296.8910 317.4149 325.0031 336.1878 417.6170 426.1603 450.1033 465.1160 492.7700 510.0449 517.3963 536.0913 550.2465 598.0439 634.7779 707.8376 759.2613 763.2472 781.4524 801.0771 824.3467 830.4690 850.1673 867.8793 903.0952 950.1108 959.9629 987.5342 990.8417 1006.2302 1011.6500 1025.0492 1026.4981 1039.9906 1050.2624 1084.3770 1098.5132 1155.8633 1164.3242 1177.6775 1201.5024 1207.0736 1229.8553 1251.6771 1262.6931 1291.1833 1305.7608 1334.5821 1379.6604 1385.5898 1405.9249 1419.3158 1422.1972 1447.3532 1455.7216 1460.6270 1498.8062 1531.8716 1579.0967 1589.1309 1623.6914 3000.8934 3047.5419 3055.5301 3066.8186 3110.2776 3117.2801 3151.4067 3154.0618 3162.3217 3167.1778 3183.3930 3184.8790 3204.7059 3490.5690
redmass: 7.8316 5.5080 5.5629 4.7246 5.9722 4.5485 8.0180 3.9416 3.5856 2.3053 4.3170 3.4902 4.8760 2.7050 1.4957 6.3674 3.9185 4.3915 3.3124 3.1616 5.8047 6.3039 4.5014 4.5506 6.5672 4.2384 3.8497 4.4141 1.7401 1.4550 1.5821 4.7901 3.3464 1.5652 3.1157 2.9303 1.3745 1.5000 4.0241 2.0263 1.4713 1.4056 2.6920 1.6584 1.6442 2.3362 1.4420 2.7567 2.1197 1.3250 1.3986 1.4855 1.4216 1.1894 1.8248 1.6698 1.3168 1.2241 1.5945 1.2263 1.3624 2.0180 2.2966 1.1155 4.9757 1.2343 1.7287 1.7830 1.1509 3.8223 5.5654 5.2661 6.2520 1.0633 1.0635 1.0607 1.0922 1.1037 1.0977 1.1111 1.0898 1.0926 1.0937 1.0925 1.1001 1.0999 1.0666
irintensity: 0.7636 0.9250 2.6248 0.9413 9.2312 0.3952 1.8091 4.8363 7.1377 13.8564 4.7464 7.8203 12.7181 11.7603 120.8506 17.4953 7.8528 7.3815 1.0803 2.4672 12.2160 3.7701 35.2340 3.8777 80.4993 2.5636 2.0731 3.2445 3.8318 6.2501 47.6343 1.0081 40.5785 86.9894 22.0972 9.1431 1.4132 6.8233 96.2978 36.8122 6.6466 2.7626 6.0564 3.6995 13.0896 6.3798 70.9461 4.7673 2.4336 9.0146 12.5113 7.6487 3.4470 1.5397 10.7709 10.7010 9.0825 3.9395 8.8382 6.7903 4.9084 37.0512 9.0547 21.4806 29.1811 9.0603 6.4280 8.1336 14.5487 74.4354 22.3270 11.9578 23.2014 3.7252 2.8043 1.0065 1.6367 14.7187 89.8010 0.9526 0.4700 0.2320 0.0140 0.3646 3.6556 1.1899 81.5863
temp: 298.150 k
press: 1.00000 atm
elementType: 16 8 8 8 7 6 6 6 6 6 6 6 6 6 6 6 6 1 1 1 1 1 1 1 1 1 1 1 1 1 1
symmnumber: 1
zpe: 633393.1 jmol-1
zpe.correction: 0.241247 hartree
zpe.thermalcorrener: 0.257356 hartree
zpe.thermalcorrenthalpy: 0.258300 hartree
zpe.thermalcorrgfe: 0.197181 hartree
zpe.sumelectzpe: -1142.518944 hartree
zpe.sumelectthermal: -1142.502835 hartree
zpe.sumelectthermalent: -1142.501891 hartree
zpe.sumelectthermalfe: -1142.563009 hartree
dipole: -7.6971 -5.0130 -0.0998
dipole: 9.1862
quadrupole: -65.9248 -78.2261 -100.5420
quadrupole: -6.6831 4.2107 3.7228
quadrupole: 15.6395 3.3382 -18.9777 -6.6831 4.2107 3.7228
hfenergy: -1142.7601909 hartree
pointgroup: C01 [X(C12H14N1O3S1)]
dipole: 2.7148071 2.3629368 0.3289707 debye
polarizability: 209.7131159|8.4170114|190.5585898|-17.5562464|29.8557112|107.8543642 unknown
InChI: InChI=1S/C12H14NO3S/c14-17(15,16)10-4-9-13-8-3-6-11-5-1-2-7-12(11)13/h1-3,5-8,14H,4,9-10H2
charge 1 multiplicity 1
31 atoms
S  -3.514654 -1.123995 0.32977
O  -3.268026 -0.811143 2.153378
O  -2.272913 -2.039133 -0.175884
O  -5.032049 -1.560304 0.025965
N  0.648966 0.938541 0.658032
C  -0.819597 0.766816 0.924918
C  -1.657731 0.920855 -0.368783
C  -3.155757 0.734798 -0.136269
C  1.408527 -0.125459 0.123117
C  2.823124 0.101539 -0.110691
C  1.219233 2.146507 0.938213
C  0.828625 -1.390962 -0.178295
C  3.389388 1.374989 0.192035
C  2.586977 2.3974 0.71393
C  3.618411 -0.965925 -0.64055
C  1.644129 -2.406155 -0.695377
C  3.03993 -2.201809 -0.927832
H  -0.982061 -0.213199 1.399839
H  -1.113051 1.530682 1.664059
H  -1.523851 1.940814 -0.780183
H  -1.312931 0.212503 -1.142785
H  -3.754637 0.881113 -1.049264
H  -3.580749 1.283208 0.71774
H  0.559995 2.911022 1.356072
H  -0.237493 -1.597397 -0.032011
H  4.456694 1.543984 0.015068
H  2.991758 3.381134 0.958552
H  4.685622 -0.792539 -0.813574
H  1.194719 -3.37696 -0.926544
H  3.647306 -3.017041 -1.331187
H  -3.671702 -1.564482 2.673841
