program: Gaussian 09
title: 000078379
version: EM64L-G09RevD.01
frameworkgroup: C1[X(C9H13NO3S2)]
method: RPBEPBE
basis: SDD
operation: Freq
keyword: #p
keyword: freq=noraman
keyword: PBEPBE/SDD
title: #p freq=noraman PBEPBE/SDD
converged: YES YES NO NO
title: Mulliken charges:
elementType: S S O O O N C C C C C C C C C H H H H H H H H H H H H H
charge: 0.313759 0.124447 -0.202121 -0.416678 -0.229637 -0.042271 -0.360214 -0.353641 -0.402912 -0.382403 -0.488366 0.293640 -0.785625 -0.539978 0.173913 0.229517 0.222889 0.199966 0.197464 0.249648 0.254007 0.224314 0.224307 0.253737 0.254486 0.305898 0.305040 0.376813
chargesum: 0.00000
title: Mulliken charges with hydrogens summed into heavy atoms:
elementType: S S O O O N C C C C C C C C C
charge: 0.313759 0.124447 -0.202121 -0.039864 -0.229637 -0.042271 0.092193 0.043789 0.100743 0.066218 0.019857 0.293640 -0.174687 -0.539978 0.173913
polarizability: 1.73413135e+02 1.03258169e+01 1.60782601e+02 -1.85020760e+01 -4.40888333e+00 1.05595688e+02
1716.lowfreq: -10.0828 -1.2672 -0.0030 -0.0029 -0.0029 6.0187 13.8169 18.6026 38.8759
frequency: 13.7271 18.3121 38.8722 48.3503 56.1895 77.0132 115.9359 118.9872 123.9314 130.8830 171.7725 245.7974 262.4014 321.3130 352.4186 379.6721 397.3017 485.4453 491.2459 500.5190 510.4857 522.8543 585.1455 592.6175 635.9032 639.1884 719.0567 730.5514 750.0348 809.8413 846.3907 860.1692 890.0948 935.4570 978.0922 1003.7827 1044.8913 1045.8067 1080.8059 1082.1801 1100.4502 1110.2216 1117.7846 1147.5063 1222.1621 1225.0725 1227.0990 1257.9693 1262.9948 1287.8812 1291.0618 1297.9112 1310.8849 1347.6811 1356.2597 1373.3836 1378.4046 1422.1110 1437.1492 1444.7870 1464.4226 1468.7294 1483.0973 1636.1194 1669.4995 2957.9923 2987.0263 2990.8879 2998.9804 3003.7738 3018.9360 3031.5853 3050.0163 3050.1487 3065.7537 3090.7411 3122.6036 3512.6985
redmass: 11.8007 8.4765 7.6679 2.0538 3.1034 10.0122 5.4560 2.5673 2.7937 2.0641 6.7615 6.9601 8.3063 3.0426 4.3362 6.0571 14.7602 4.2564 5.2123 1.8096 15.8749 5.0482 4.8321 4.2366 5.1391 1.3152 4.9841 1.1006 1.2482 1.9386 2.3845 4.5031 1.6360 1.9521 2.5644 4.5624 2.7738 3.8317 2.7485 4.7322 3.2769 1.6677 1.1692 1.7107 1.6907 1.3570 1.3158 1.4691 1.6500 1.8728 1.2826 1.3118 1.5490 1.5340 1.5809 1.6176 1.5826 1.0810 1.0848 1.1068 1.0678 1.0890 1.0993 11.3873 8.2640 1.0590 1.0611 1.0594 1.0596 1.1000 1.0580 1.0989 1.0836 1.0760 1.1036 1.1062 1.1067 1.0639
irintensity: 1.1919 0.2702 0.5705 0.3069 0.1346 1.7709 5.8140 1.0509 3.6951 0.1565 2.6450 2.3914 2.2416 3.1597 1.1297 35.9266 1.1044 5.6819 21.9544 27.6348 4.7643 3.4847 13.4956 7.5033 10.3494 129.1352 10.7418 15.4955 0.0438 11.9647 16.5404 0.6505 6.8797 23.7763 46.9520 60.3910 120.5601 75.7933 14.4286 0.2299 27.2994 24.3118 0.1410 130.1064 99.4808 51.7177 28.6019 15.4458 105.3550 81.9794 37.5772 38.2294 4.5574 135.6181 37.0533 23.5567 17.0280 13.0803 26.6248 37.7091 0.3758 0.5652 23.6191 243.4329 206.4071 22.8579 6.6135 4.9530 35.9812 9.1670 24.4952 0.0579 0.0935 5.7414 55.1700 7.3386 0.0293 19.9630
temp: 298.150 k
press: 1.00000 atm
elementType: 16 16 8 8 8 7 6 6 6 6 6 6 6 6 6 1 1 1 1 1 1 1 1 1 1 1 1 1
symmnumber: 1
zpe: 561259.3 jmol-1
zpe.correction: 0.213772 hartree
zpe.thermalcorrener: 0.230265 hartree
zpe.thermalcorrenthalpy: 0.231209 hartree
zpe.thermalcorrgfe: 0.164801 hartree
zpe.sumelectzpe: -1426.180530 hartree
zpe.sumelectthermal: -1426.164038 hartree
zpe.sumelectthermalent: -1426.163094 hartree
zpe.sumelectthermalfe: -1426.229501 hartree
dipole: 0.0532 -1.4147 -1.2387
dipole: 1.8811
quadrupole: -91.6516 -114.9907 -107.4452
quadrupole: 9.8474 -7.8739 -2.3524
quadrupole: 13.0443 -10.2949 -2.7494 9.8474 -7.8739 -2.3524
hfenergy: -1426.3943029 hartree
pointgroup: C01 [X(C9H13N1O3S2)]
dipole: -0.0150467 0.5633668 0.4796884 debye
polarizability: 173.5042106|-9.356866|159.7528204|20.261978|-4.4685346|106.5343926 unknown
InChI: InChI=1S/C9H13NO3S2/c11-7-6-15-9(14)10(7)5-3-1-2-4-8(12)13/h12H,1-6H2
charge 0 multiplicity 1
28 atoms
S  -4.686054 -0.852863 -0.915751
S  -2.538087 -2.753176 0.230459
O  -2.660883 2.353144 0.302509
O  6.298653 -0.053469 0.402222
O  5.091786 0.051952 -1.578167
N  -2.495487 0.002987 0.335669
C  0.00241 0.019863 0.056739
C  1.351291 0.002914 0.809034
C  -1.187883 0.023421 1.039257
C  2.556406 0.0094 -0.156032
C  3.899477 -0.017432 0.596922
C  -3.132066 1.226524 0.012713
C  -4.452277 1.00969 -0.721752
C  -3.109898 -1.196231 -0.049173
C  5.099548 -0.000984 -0.329298
H  -0.068777 -0.868746 -0.598731
H  -0.053039 0.917756 -0.588256
H  1.399349 -0.89679 1.457144
H  1.410338 0.883124 1.482765
H  -1.176889 0.939643 1.655657
H  -1.155128 -0.867074 1.69149
H  2.498874 -0.862119 -0.835556
H  2.516376 0.905592 -0.803872
H  3.990668 0.84837 1.282388
H  3.980304 -0.915265 1.24068
H  -5.282247 1.4334 -0.135195
H  -4.417468 1.490747 -1.711528
H  7.067003 -0.039776 -0.231138
