program: Gaussian 09
title: 000078348
version: EM64L-G09RevD.01
frameworkgroup: C1[X(C6H8N2O2)]
method: RPBEPBE
basis: SDD
operation: Freq
keyword: #pfreq=noraman
keyword: PBEPBE/SDD
title: #p freq=noraman PBEPBE/SDD
converged: NO NO NO NO
title: Mulliken charges:
elementType: O O N N C C C C C C H H H H H H H H
charge: -0.275781 -0.275780 -0.127619 -0.127619 -0.254053 -0.254057 0.183133 0.183134 -0.503910 -0.503907 0.266215 0.266216 0.241913 0.241928 0.228173 0.241929 0.228171 0.241913
chargesum: 0.00000
title: Mulliken charges with hydrogens summed into heavy atoms:
elementType: O O N N C C C C C C
charge: -0.275781 -0.275780 -0.127619 -0.127619 0.012163 0.012159 0.183133 0.183134 0.208104 0.208105
polarizability: 1.31440219e+02 -3.29536724e-05 8.31923776e+01 -1.39500323e-03 -5.13272437e-04 4.51760077e+01
1716.lowfreq: -9.3170 -2.7582 -0.0006 0.0006 0.0007 23.7136 89.7176 114.0767 152.9000
frequency: 89.4365 114.0683 152.8933 165.0056 165.3684 190.9409 255.2513 354.6168 372.6593 419.8230 509.9445 528.2724 537.2730 613.1589 724.5657 734.9094 788.4698 831.2581 956.2341 959.2463 962.6276 976.9410 1080.2939 1113.6630 1114.2309 1142.9715 1152.7951 1167.7582 1242.6443 1274.2309 1328.3085 1356.7833 1434.4881 1442.6140 1444.5925 1444.6981 1466.2462 1467.9749 1515.1509 1583.7498 2995.4302 2996.1473 3093.9549 3094.0011 3138.8708 3139.0702 3168.2643 3189.3602
redmass: 4.3072 3.2004 1.6553 1.0533 3.2340 1.8613 3.5516 4.3949 6.0016 9.7249 3.9520 3.4376 5.2390 8.2494 6.9534 7.0645 8.0930 1.5679 9.3014 7.9979 1.3113 3.9882 1.6687 1.2542 1.2553 1.3063 1.4026 3.9431 2.2764 5.2982 5.3986 2.5444 1.2384 1.3754 1.0508 1.0507 1.0556 1.0511 5.0457 6.5507 1.0292 1.0293 1.1039 1.1039 1.1052 1.1052 1.0895 1.1003
irintensity: 9.1268 0.0000 11.6311 0.0039 1.4093 8.6901 28.2793 0.0000 2.6636 0.0000 0.0025 0.3222 1.1180 0.1256 32.9437 0.0000 0.0041 55.0738 58.0324 89.0183 0.0000 9.5403 5.5705 0.0000 0.3133 0.1856 4.0313 0.8370 207.3041 26.6039 5.8805 390.9772 12.3931 86.9888 0.0362 26.9844 57.5824 1.0053 68.4258 6.1113 54.7206 37.7183 2.5204 54.9354 44.5389 4.6854 1.7360 3.0479
temp: 298.150 k
press: 1.00000 atm
elementType: 8 8 7 7 6 6 6 6 6 6 1 1 1 1 1 1 1 1
symmnumber: 1
zpe: 358827.4 jmol-1
zpe.correction: 0.136670 hartree
zpe.thermalcorrener: 0.146396 hartree
zpe.thermalcorrenthalpy: 0.147341 hartree
zpe.thermalcorrgfe: 0.101731 hartree
zpe.sumelectzpe: -492.570008 hartree
zpe.sumelectthermal: -492.560282 hartree
zpe.sumelectthermalent: -492.559337 hartree
zpe.sumelectthermalfe: -492.604947 hartree
dipole: 0.0000 0.8943 0.0000
dipole: 0.8943
quadrupole: -48.7855 -55.9978 -59.0874
quadrupole: 0.0000 0.0005 0.0000
quadrupole: 5.8380 -1.3742 -4.4638 0.0000 0.0005 0.0000
hfenergy: -492.7066779 hartree
pointgroup: C01 [X(C6H8N2O2)]
dipole: -0.0000149 0.3518281 0.0000009 debye
dipolederiv: -1.6523501 0.3140798 0.00001 0.2392401 -0.4514833 -0.0000136 0.0000098 0.0000291 -0.3084987 -1.652363 -0.3140908 0.0000162 -0.2392468 -0.4514833 0.0000171 0.0000123 -0.0000225 -0.3085007 -0.4080863 0.3526275 0.0000052 -0.6039177 -0.0731828 0.0000155 0.0000209 -0.0000153 -0.2235365 -0.408108 -0.3526316 0.0000127 0.6039225 -0.0731903 -0.0000193 -0.000005 0.0000076 -0.2235398 -0.1697328 -0.0220239 0.0000037 0.2258434 0.0881498 -0.0000076 0.000007 -0.000005 -0.098124 -0.1697308 0.0220211 -0.0000007 -0.2258478 0.0881479 0.0000053 0.0000069 0.0000044 -0.098124 1.6058197 -0.270831 -0.0000211 0.1657951 -0.0732765 0.0000066 -0.0000764 0.0000013 0.200041 1.6058394 0.2708443 -0.0000214 -0.1657909 -0.0732698 0.0000006 -0.0000576 0.0000096 0.2000455 0.5949677 -0.1707811 -0.0000015 -0.4166726 0.4518349 0.0000453 0.000049 0.0000219 0.2740263 0.5949811 0.1707876 -0.0000059 0.4166711 0.4518381 -0.0000492 0.0000338 -0.0000276 0.2740274 0.07194 -0.0740212 0.0000008 -0.0667211 0.0032247 0.0000018 -0.0000024 0.0000012 0.1572439 0.0719384 0.0740222 0.0000002 0.0667224 0.0032242 0.000001 -0.0000028 -0.0000019 0.1572433 0.0643871 -0.0299927 -0.0685791 0.103603 -0.0110824 -0.0741658 -0.0169219 -0.0929066 -0.0618104 0.0643985 -0.0300638 0.0686427 0.1035319 -0.01108 0.0741562 0.0169845 0.0928803 -0.0617023 -0.1713395 0.0009132 -0.0000614 -0.0607784 0.0768966 -0.0000308 -0.000063 -0.0000193 0.1223604 0.0643954 0.0300622 0.0686393 -0.1035336 -0.0110858 -0.0741571 0.0169863 -0.0928816 -0.0616988 -0.1713426 -0.0009128 -0.0000586 0.0607815 0.0768961 0.0000306 -0.0000626 0.0000198 0.1223593 0.0643859 0.029991 -0.0685812 -0.1036023 -0.011078 0.0741634 -0.0169189 0.0929047 -0.0618119 unknown
polarizability: 131.4402191|0.0001564|83.1923776|-0.001395|-0.0005133|45.1760077 unknown
InChI: InChI=1S/C6H8N2O2/c1-9-5-3-4-6(10-2)8-7-5/h3-4H,1-2H3
charge 0 multiplicity 1
18 atoms
O  2.732439 0.241501 -0.000045
O  -2.732465 0.241477 0.000023
N  0.690987 -0.951115 0.000015
N  -0.691007 -0.951115 0.00001
C  0.696413 1.512269 -0.000036
C  -0.696456 1.51226 -0.000012
C  1.349245 0.240031 0.000005
C  -1.349276 0.240018 -0.000019
C  3.396699 -1.079484 0.00002
C  -3.396727 -1.079508 0.000001
H  1.286841 2.431721 -0.000054
H  -1.286889 2.431707 -0.000004
H  3.11039 -1.657766 -0.895604
H  3.109905 -1.657928 0.895386
H  4.470873 -0.843059 0.000315
H  -3.109954 -1.657973 -0.895353
H  -4.470907 -0.843072 -0.000287
H  -3.110412 -1.657765 0.89564
