program: Gaussian 09
title: 000078345
version: EM64L-G09RevD.01
frameworkgroup: C1[X(C4H3BrN2)]
method: RPBEPBE
basis: SDD
operation: Freq
keyword: #p
keyword: freq=noraman
keyword: PBEPBE/SDD
title: #p freq=noraman PBEPBE/SDD
converged: NO NO NO NO
title: Mulliken charges:
elementType: Br N N C C C C H H H
charge: 0.063056 0.065625 0.065614 -0.157527 -0.246240 -0.246242 -0.313236 0.245424 0.261764 0.261762
chargesum: 0.00000
title: Mulliken charges with hydrogens summed into heavy atoms:
elementType: Br N N C C C C
charge: 0.063056 0.065625 0.065614 0.087897 0.015524 0.015520 -0.313236
polarizability: 1.10881755e+02 -5.20198846e-04 6.13419288e+01 5.52411216e-03 -3.17964050e-04 2.51037749e+01
1716.lowfreq: -12.5229 -11.4055 -0.0008 -0.0008 -0.0007 23.0466 128.1202 260.6563 306.7690
frequency: 128.1202 260.6562 306.7690 397.5994 462.2051 596.9710 712.4497 776.7987 812.4913 922.7531 957.4486 988.0354 1048.9777 1067.2238 1133.0359 1229.7337 1234.5656 1372.5122 1387.1533 1509.5530 1522.6731 3148.3134 3152.0983 3187.8243
redmass: 6.3626 7.7952 15.2120 4.1669 3.0053 8.5483 8.1061 7.3062 1.2095 9.8021 1.3742 1.4487 3.0964 1.7087 4.5522 6.3518 1.9038 1.9773 1.4880 5.5183 4.2364 1.0898 1.0936 1.1000
irintensity: 7.1201 3.6584 7.1607 0.0000 3.2517 9.7574 34.5224 1.5871 48.3971 11.3311 0.0000 0.0198 2.7202 5.9408 199.5024 6.7144 5.0123 225.8762 0.3671 84.0388 91.0952 8.8352 11.0782 12.5726
temp: 298.150 k
press: 1.00000 atm
elementType: 35 7 7 6 6 6 6 1 1 1
symmnumber: 1
zpe: 169367.1 jmol-1
zpe.correction: 0.064509 hartree
zpe.thermalcorrener: 0.070169 hartree
zpe.thermalcorrenthalpy: 0.071113 hartree
zpe.thermalcorrgfe: 0.033480 hartree
zpe.sumelectzpe: -276.665312 hartree
zpe.sumelectthermal: -276.659651 hartree
zpe.sumelectthermalent: -276.658707 hartree
zpe.sumelectthermalfe: -276.696340 hartree
dipole: 4.3938 0.0000 -0.0007
dipole: 4.3938
quadrupole: -35.2651 -51.2926 -50.7042
quadrupole: 0.0001 0.0009 0.0000
quadrupole: 10.4889 -5.5387 -4.9502 0.0001 0.0009 0.0000
hfenergy: -276.7298201 hartree
pointgroup: C01 [X(C4H3Br1N2)]
dipole: -1.7286612 -0.0001156 -0.000272 debye
dipolederiv: -0.857037 -0.0000437 0.0001802 -0.0000609 -0.033994 -0.0000011 0.0004693 -0.000002 -0.0239283 -0.9801061 0.0447695 0.0000941 0.5141391 -0.492086 -0.0001839 0.0000592 0.0000704 -0.1620869 -0.9800411 -0.0448289 0.0000903 -0.5141957 -0.4920911 0.0001721 0.0000113 -0.0000763 -0.1620939 -0.1058386 0.0000438 0.0000652 0.0000167 -0.4731015 -0.0000044 0.0000769 -0.0000013 -0.0554551 0.4326365 0.0692772 0.0000126 -0.1183795 0.4597727 -0.0000669 0.0000088 0.000064 -0.0117754 0.4326575 -0.0692893 0.0000161 0.118272 0.4597795 0.0000673 0.0000046 -0.000057 -0.0117689 2.092856 0.000093 -0.0004138 0.0001458 0.4896044 0.0000119 -0.0004206 0.0000071 0.0080286 -0.0781499 -0.0000195 -0.0000642 -0.0000094 0.1155136 0.000001 -0.0000336 -0.0000003 0.1710677 0.0214855 0.0631329 0.0000085 0.0958269 -0.0166838 0.0000471 -0.0000879 -0.0000211 0.1240089 0.0215371 -0.063135 0.000011 -0.0957551 -0.0167137 -0.0000433 -0.0000881 0.0000165 0.1240033 unknown
polarizability: 110.8817547|0.0029166|61.341929|-0.0055241|0.0003176|25.1037749 unknown
InChI: InChI=1S/C4H3BrN2/c5-4-6-2-1-3-7-4/h1-3H
charge 0 multiplicity 1
10 atoms
Br 2.796141 0.000192 -0.000442
N  0.248314 1.217562 0.000186
N  0.248501 -1.217543 0.00016
C  -1.85953 -0.000137 -0.000195
C  -1.119179 1.20481 -0.000115
C  -1.118976 -1.204983 -0.000132
C  0.844721 0.000074 0.000637
H  -2.952277 -0.000238 -0.000385
H  -1.607323 2.185102 -0.000191
H  -1.606993 -2.185339 -0.000224
