program: Gaussian 09
title: 000078343
version: EM64L-G09RevD.01
frameworkgroup: C1[X(C10H9NO)]
method: RPBEPBE
basis: SDD
operation: Freq
keyword: #p
keyword: freq=noraman
keyword: PBEPBE/SDD
title: #p freq=noraman PBEPBE/SDD
converged: NO YES NO YES
title: Mulliken charges:
elementType: O N C C C C C C C C C C H H H H H H H H H
charge: -0.285188 -0.164051 0.109523 0.416193 0.091129 -0.354127 -0.185285 -0.340633 -0.399847 -0.634994 -0.238722 -0.224993 0.235695 0.242824 0.275611 0.232793 0.289440 0.236202 0.236178 0.232744 0.229507
chargesum: 0.00000
title: Mulliken charges with hydrogens summed into heavy atoms:
elementType: O N C C C C C C C C C C
charge: -0.285188 -0.164051 0.109523 0.416193 0.091129 -0.118432 0.057540 -0.065022 -0.167054 0.126827 -0.005978 0.004513
polarizability: 1.74911973e+02 -4.48183660e+00 1.27997491e+02 4.97283647e-03 4.85433501e-04 5.07725458e+01
1716.lowfreq: -0.0006 -0.0004 -0.0004 5.5738 17.0889 19.7407 91.5769 103.5397 135.4441
frequency: 91.5769 103.5115 135.4423 222.8951 265.4761 271.1018 359.2493 416.5156 418.5634 473.9292 481.0677 527.6339 580.3322 600.4494 682.5373 686.8022 743.7326 751.9910 796.0242 803.2352 868.7786 893.1531 930.5649 935.5262 979.0724 1004.3817 1021.4380 1039.9929 1102.6378 1124.3382 1161.1364 1171.7211 1192.4009 1225.6087 1257.9795 1277.6022 1327.3870 1396.7155 1403.7296 1423.7056 1451.2372 1470.2476 1492.1747 1496.2440 1554.0546 1579.6922 1620.3964 1638.3996 2991.0718 3080.6216 3118.9717 3124.0789 3138.7870 3153.3553 3154.2664 3168.4248 3179.6395
redmass: 2.5009 1.2588 4.0456 4.2243 4.1293 4.0026 4.0484 5.9079 3.0249 3.7271 7.4793 5.1097 3.2243 6.5201 4.2151 6.0645 5.9681 1.3015 3.3404 1.4426 5.0601 1.5212 1.3052 4.6532 1.3829 1.3356 2.1638 2.0676 1.9618 1.3083 1.2059 1.1233 2.7115 2.0465 2.8431 1.8435 2.3601 2.3974 2.4434 1.6075 2.1318 1.1106 2.8815 1.0447 6.8578 7.6613 6.7260 6.8020 1.0340 1.1029 1.0994 1.0862 1.0901 1.0936 1.0883 1.0995 1.0999
irintensity: 5.5097 1.9330 0.4667 0.8206 2.7931 2.0677 11.9248 7.6694 6.8425 2.4712 2.3502 0.3566 5.0734 0.5754 27.5034 0.2846 9.3218 3.8431 0.5866 117.2851 2.5773 3.2302 0.0488 4.2274 3.6222 0.3545 19.4154 5.3397 14.9793 0.2841 1.5917 1.1032 23.7883 5.8518 10.4462 17.8838 40.1482 37.3668 0.9835 30.3995 29.5973 30.5528 13.2069 19.1085 31.3230 212.9795 22.5724 131.9605 67.6910 26.3784 0.4913 2.4623 15.4325 13.5750 1.9105 23.5164 13.3311
temp: 298.150 k
press: 1.00000 atm
elementType: 8 7 6 6 6 6 6 6 6 6 6 6 1 1 1 1 1 1 1 1 1
symmnumber: 1
zpe: 434014.7 jmol-1
zpe.correction: 0.165307 hartree
zpe.thermalcorrener: 0.174838 hartree
zpe.thermalcorrenthalpy: 0.175783 hartree
zpe.thermalcorrgfe: 0.130480 hartree
zpe.sumelectzpe: -515.621817 hartree
zpe.sumelectthermal: -515.612286 hartree
zpe.sumelectthermalent: -515.611341 hartree
zpe.sumelectthermalfe: -515.656644 hartree
dipole: -0.2074 3.6606 -0.0003
dipole: 3.6664
quadrupole: -54.0048 -69.6562 -73.8405
quadrupole: -6.7042 0.0013 0.0038
quadrupole: 11.8291 -3.8224 -8.0067 -6.7042 0.0013 0.0038
hfenergy: -515.787124 hartree
pointgroup: C01 [X(C10H9N1O1)]
dipole: 0.1034684 -1.4387662 -0.0004865 debye
dipolederiv: -0.6179365 -0.2787516 -0.0000054 -0.3577334 -1.1827552 0.0001142 -0.0004013 -0.0010216 -0.3678659 -0.5715292 0.3453136 0.0001045 -0.6932083 -0.7672517 -0.000329 -0.0004502 0.0000151 -0.1600404 -0.3243471 -0.3295984 -0.0001214 -0.0137624 -0.1599053 -0.0000289 0.0001541 -0.000068 -0.0268553 0.4205866 -0.2583507 -0.0000454 -0.1850263 0.0854689 -0.0000837 0.0001586 0.0000342 0.0842354 0.7477209 0.1004809 0.0000086 0.3206109 1.4185963 0.0001017 0.0001819 0.000957 0.1769288 -0.4962601 0.0986452 -0.0000209 -0.0630518 -0.0500594 0.0000227 -0.0001935 -0.0000909 -0.2478499 0.3355355 0.0483881 0.0000679 0.7497787 0.3896889 0.0001774 0.0001218 0.000081 -0.0784672 -0.0223573 0.2077347 -0.000016 -0.0912365 0.0165248 -0.0000047 0.0000085 -0.0000041 -0.1047439 -0.2890458 0.2146179 0.0000213 0.120083 0.0840877 0.0000495 0.0000026 0.0000235 -0.1837087 0.5389457 -0.0100633 -0.0000532 0.1799429 0.0050717 -0.0000861 0.000168 -0.0001079 0.2288222 -0.0481618 -0.2425424 -0.0000639 -0.0500047 -0.0834173 0.0000675 -0.0000436 0.000099 -0.1799788 0.1817051 0.017524 -0.0000316 -0.0006843 0.1538732 0.0000458 -0.0000451 0.0000468 -0.1321517 0.0581118 -0.0563425 -0.000008 0.010874 -0.0722354 -0.0000406 0.0000166 -0.000008 0.1751895 -0.0138924 0.0967755 -0.0000313 0.0622954 0.0177503 -0.0000127 0.0001152 0.0000469 0.1681387 0.1130971 -0.0606017 0.0000019 0.0059836 -0.0037217 -0.0000067 0.0000256 -0.0000261 0.1552223 0.0681896 -0.0116652 0.0000072 -0.068582 -0.106473 -0.0000428 -0.0000387 -0.0000098 0.1586757 0.190317 0.0432784 0.0000416 -0.1294354 0.0112897 -0.0001448 -0.0000184 -0.0000655 0.1314907 -0.0551634 0.0147677 0.0470096 0.075599 0.0873403 -0.0952994 0.118751 -0.0661662 -0.0580536 -0.0548908 0.014797 -0.0469227 0.0757364 0.0871312 0.0955593 -0.1185943 0.0663526 -0.0578182 -0.0320052 0.1000533 0.0000383 0.1110994 -0.0133937 -0.000051 0.0000391 -0.0000747 0.16293 -0.1286196 -0.0544603 0.0000189 -0.0592783 0.0823896 -0.0000077 0.0000422 -0.0000132 0.1559004 unknown
polarizability: 175.0373431|-3.766895|127.8721172|0.0006095|0.0188471|50.7725503 unknown
InChI: InChI=1S/C10H9NO/c1-11-7-6-8-4-2-3-5-9(8)10(11)12/h2-7H,1H3
charge 0 multiplicity 1
21 atoms
O  1.464355 2.09368 0.001002
N  2.049377 -0.179286 -0.000021
C  -0.326915 0.443276 -0.000187
C  -0.684442 -0.947578 -0.000386
C  1.088291 0.877077 -0.000498
C  0.372071 -1.935858 -0.000571
C  1.686213 -1.527728 -0.000265
C  -1.340233 1.438452 0.000173
C  -2.067089 -1.300785 -0.000297
C  3.483504 0.184113 0.000559
C  -2.696123 1.070826 0.000275
C  -3.057583 -0.30598 0.000027
H  0.136407 -3.003245 -0.000714
H  2.518913 -2.236598 -0.000136
H  -1.027718 2.487739 0.000277
H  -2.347085 -2.360915 -0.000444
H  3.545001 1.283248 0.001345
H  3.983067 -0.211333 -0.901359
H  3.982669 -0.212741 0.902071
H  -3.475123 1.84067 0.000538
H  -4.116058 -0.590133 0.000112
