program: Gaussian 09
title: 000078357
version: EM64L-G09RevD.01
frameworkgroup: C1[X(C11H7NO3)]
method: RPBEPBE
basis: SDD
operation: Freq
keyword: #p
keyword: freq=noraman
keyword: PBEPBE/SDD
title: #p freq=noraman PBEPBE/SDD
converged: YES YES NO NO
title: Mulliken charges:
elementType: O O O N C C C C C C C C C C C H H H H H H H
charge: -0.172029 -0.179377 -0.179372 -0.193385 0.174918 0.174915 0.120759 0.120759 -0.344712 -0.344712 -0.209341 -0.209341 -0.352077 0.206619 -0.427007 0.270883 0.270883 0.241246 0.241247 0.254545 0.254522 0.280058
chargesum: 0.00000
title: Mulliken charges with hydrogens summed into heavy atoms:
elementType: O O O N C C C C C C C C C C C
charge: -0.172029 -0.179377 -0.179372 -0.193385 0.174918 0.174915 0.120759 0.120759 -0.073829 -0.073829 0.031905 0.031905 0.156990 0.206619 -0.146949
polarizability: 2.16626583e+02 -4.26351801e-03 1.33587408e+02 -1.07085490e+01 8.89680667e-04 5.86680823e+01
1716.lowfreq: -15.8299 -7.3995 -5.3185 -0.0010 -0.0009 -0.0008 10.7200 34.0384 44.4347
frequency: -2.7583 33.9687 44.4341 124.3833 136.7908 153.4531 189.6089 232.0735 271.7619 294.8776 317.7536 343.5357 401.7210 425.3683 453.0084 510.9452 534.3768 593.6276 635.4575 657.3593 687.2126 687.8257 691.0142 695.3055 780.5823 790.7990 851.0039 857.0809 908.7573 923.1516 975.5113 981.8378 982.5349 1007.8854 1014.5750 1052.9216 1082.4843 1165.3777 1168.3382 1177.5806 1192.3150 1261.1928 1283.9626 1343.4570 1414.3762 1452.3397 1453.1209 1455.7957 1611.2366 1618.0147 1646.5664 1686.1831 2155.4658 2997.7167 3062.7739 3141.2037 3154.2666 3165.6716 3175.6895 3424.0377
redmass: 3.0481 4.6836 6.1120 8.3856 4.9786 5.6679 6.2191 6.4656 7.4936 11.1500 3.6399 8.4032 3.2668 6.1771 4.8913 7.4868 9.6359 13.3803 1.2326 4.8196 3.9798 7.8985 1.3180 5.4961 5.4383 1.4696 7.8427 10.4676 1.3848 10.1010 1.4082 1.6144 3.7238 1.3468 2.0847 5.1068 4.2122 1.4288 1.9470 1.0561 2.1784 6.2064 1.4918 1.3577 6.4498 2.5317 2.4437 1.1426 7.5562 7.5393 12.8030 12.7362 6.0064 1.0549 1.1086 1.0865 1.0906 1.0956 1.1004 1.1611
irintensity: 4.8451 0.4583 2.6800 3.0283 0.0003 2.8033 0.4113 1.1605 3.7004 9.2920 4.8497 1.2913 3.3423 4.3385 0.0715 10.2157 0.3606 8.7326 70.2348 0.0129 44.2008 3.7677 59.3804 35.7089 0.0002 42.6634 31.0749 57.8896 0.0037 106.7240 2.3251 2.5020 24.3111 0.0001 0.1959 74.6406 10.1281 20.7739 1.7447 3.3733 13.0622 138.9340 0.4102 75.9679 10.1294 0.3428 12.6061 3.5918 2.5291 21.6112 450.0282 28.4991 7.5412 15.7630 6.6411 1.6866 4.4822 4.7960 20.4456 68.4012
temp: 298.150 k
press: 1.00000 atm
elementType: 8 8 8 7 6 6 6 6 6 6 6 6 6 6 6 1 1 1 1 1 1 1
symmnumber: 1
zpe: 397947.8 jmol-1
zpe.correction: 0.151570 hartree
zpe.thermalcorrener: 0.163810 hartree
zpe.thermalcorrenthalpy: 0.164754 hartree
zpe.thermalcorrgfe: 0.112034 hartree
zpe.sumelectzpe: -702.642773 hartree
zpe.sumelectthermal: -702.630533 hartree
zpe.sumelectthermalent: -702.629589 hartree
zpe.sumelectthermalfe: -702.682309 hartree
dipole: -3.2503 -0.0020 2.2772
dipole: 3.9686
quadrupole: -56.5811 -94.9342 -86.2569
quadrupole: -0.0106 2.5311 0.0014
quadrupole: 22.6763 -15.6768 -6.9995 -0.0106 2.5311 0.0014
hfenergy: -702.7943431 hartree
pointgroup: C01 [X(C11H7N1O3)]
dipole: 1.2774137 0.0009918 0.8978335 debye
dipolederiv: -0.5849542 -0.0000172 0.0506538 0.0000098 -0.2418867 0.0000265 0.2543869 0.000037 -0.1263634 -0.5671428 0.2595789 -0.0301956 0.0858406 -1.0209901 0.0505261 0.0036357 0.0226916 -0.3106847 -0.5670711 -0.2595041 -0.0300736 -0.0857563 -1.0211179 -0.0502207 0.0036691 -0.0223897 -0.3106542 -0.3607527 0.0001171 0.0226247 0.0001171 -1.0883117 0.0002036 0.1040595 0.0002016 -0.1771596 -0.4524082 0.17896 -0.0224241 0.1416491 -0.0830344 0.0240471 -0.0486765 0.0097917 -0.0132597 -0.4523426 -0.1790156 -0.0223441 -0.1417347 -0.0831153 -0.0240235 -0.0486128 -0.0097695 -0.0132407 1.1733158 0.0067302 0.0675188 0.2815089 1.5246853 -0.069046 0.0459248 -0.0071947 0.2480924 1.1733351 -0.0067909 0.0675099 -0.2815559 1.5247502 0.0685018 0.0460684 0.0066512 0.2480622 -0.1048067 -0.0857251 -0.0027273 0.1168228 0.1348458 0.0052904 0.0057763 -0.0097405 -0.0944051 -0.1048115 0.0856749 -0.0027642 -0.1168658 0.1348508 -0.0053889 0.0058229 0.0096432 -0.0944073 0.1184967 0.112375 0.0323744 0.0776615 -0.0419494 0.0031111 0.026619 0.0108241 -0.1354923 0.1185317 -0.1123255 0.0324226 -0.0776166 -0.0419835 -0.0031455 0.0266533 -0.0108592 -0.1354866 0.9982302 -0.0000783 -0.0896594 -0.0001653 0.3145615 -0.0000372 -0.5196854 -0.0000669 0.3864504 -0.2457682 0.0001864 0.0544681 0.0003428 -0.0488982 0.000076 0.0577487 0.0000766 -0.142196 -0.4141485 -0.0002239 -0.0140459 -0.0005794 -0.2774695 -0.0001261 -0.0058429 -0.0000703 -0.2314733 0.1057555 0.0240512 -0.0063182 -0.0200736 -0.021886 -0.0019743 -0.0059399 0.0021658 0.1584872 0.1057567 -0.024031 -0.0063082 0.0200947 -0.0218866 0.002051 -0.0059473 -0.0020892 0.1584874 -0.0668268 -0.0756124 -0.0215972 -0.0805479 0.0519255 -0.0084051 -0.0250096 -0.008358 0.1564831 -0.0668552 0.0755828 -0.0216314 0.0805146 0.0519618 0.0084462 -0.025046 0.0083987 0.1564759 -0.0301232 0.0577917 -0.0262276 0.0359545 -0.0039269 0.0947297 0.0596335 0.040939 0.0152768 -0.0301741 -0.057814 -0.0262976 -0.035951 -0.0039107 -0.0947103 0.0596178 -0.0409105 0.0153136 0.2547641 0.0000898 -0.0049579 0.0003302 0.2627859 0.0000681 -0.0148558 0.0000278 0.2416941 unknown
polarizability: 216.5941644|-0.0019094|133.5874047|10.9449856|-0.0168065|58.7005042 unknown
InChI: InChI=1S/C11H7NO3/c1-2-7-15-12-10(13)8-5-3-4-6-9(8)11(12)14/h1,3-6H,7H2
charge 0 multiplicity 1
22 atoms
O  -2.080106 -0.000518 -0.533762
O  -0.368464 2.370613 -0.172404
O  -0.368021 -2.371183 -0.171375
N  -0.700458 -0.000324 -0.21124
C  1.486331 0.709386 0.013631
C  1.486463 -0.709529 0.013939
C  0.078398 1.203502 -0.134803
C  0.078618 -1.203973 -0.134279
C  2.676869 1.440109 0.140178
C  2.677135 -1.439977 0.140802
C  3.887175 0.709051 0.265952
C  3.887306 -0.708642 0.266259
C  -2.898563 -0.000277 0.753499
C  -4.307253 -0.000046 0.374584
C  -5.503383 0.000206 0.0807
H  2.664123 2.534465 0.138381
H  2.664592 -2.534337 0.139477
H  4.836608 1.246146 0.363357
H  4.836838 -1.245519 0.363896
H  -2.634453 -0.909024 1.325288
H  -2.634059 0.908381 1.325241
H  -6.545396 0.001688 -0.184822
