program: Gaussian 09
title: 000078339
version: EM64L-G09RevD.01
frameworkgroup: C1[X(C9H9NO4)]
method: RPBEPBE
basis: SDD
operation: Freq
keyword: #pfreq=noraman
keyword: PBEPBE/SDD
title: #p freq=noraman PBEPBE/SDD
converged: YES YES YES YES
title: Mulliken charges:
elementType: O O O O N C C C C C C C C C H H H H H H H H H
charge: -0.281398 -0.281399 -0.239967 -0.239968 0.006871 0.243725 0.243725 -0.344331 -0.408608 -0.408608 0.183180 0.183180 -0.499998 -0.499998 0.312871 0.286055 0.286055 0.237087 0.246107 0.246112 0.246107 0.246112 0.237087
chargesum: 0.00000
title: Mulliken charges with hydrogens summed into heavy atoms:
elementType: O O O O N C C C C C C C C C
charge: -0.281398 -0.281399 -0.239967 -0.239968 0.006871 0.243725 0.243725 -0.031460 -0.122552 -0.122553 0.183180 0.183180 0.229308 0.229308
polarizability: 1.83372454e+02 -9.46231171e-05 1.18733376e+02 -2.18758936e-02 6.44440810e-04 5.66165478e+01
1716.lowfreq: -0.0004 0.0005 0.0005 3.3387 4.2913 6.0136 39.8930 45.6481 92.9967
frequency: 39.8839 45.6442 92.9967 93.4634 97.9512 115.7409 122.2141 171.8347 198.9866 205.1171 244.8344 307.4115 307.4244 378.5648 430.9854 431.5312 452.2840 497.2961 632.0978 680.0046 695.0987 726.0316 745.3659 749.6684 814.5158 907.7317 935.2565 964.8636 973.0485 999.3277 1009.6474 1079.1590 1097.2887 1114.9977 1115.0344 1131.8775 1152.3071 1152.4509 1205.8638 1286.0517 1307.3997 1314.8891 1408.9625 1421.9307 1426.5525 1441.6267 1452.6385 1452.6559 1463.2442 1463.3975 1541.3338 1594.0079 1622.7815 1634.2071 3007.3034 3007.4393 3109.8122 3109.8398 3154.9912 3155.0196 3165.6270 3168.2637 3172.9201
redmass: 4.8753 6.8287 4.7491 1.3331 1.1839 2.4637 2.8248 4.3616 3.4992 4.8477 6.9578 4.8554 4.1949 7.5387 4.6912 5.1740 9.9644 5.7432 8.6893 8.3228 6.6435 2.2752 8.9276 6.3998 7.1409 9.0685 1.6326 7.2825 1.5202 1.4102 5.4035 7.7705 1.8696 1.2638 1.2638 2.8708 1.4921 1.4958 3.7998 2.4912 1.2989 11.3022 2.3076 1.2688 1.2646 2.5946 1.0492 1.0493 1.0515 1.0520 6.2648 6.1382 10.4011 10.2937 1.0296 1.0297 1.1047 1.1047 1.1049 1.1049 1.0930 1.0904 1.0956
irintensity: 4.2461 0.0000 1.6658 0.6326 0.0000 0.0394 0.0000 0.1446 0.0000 17.5667 3.9151 46.1433 2.0893 0.6864 5.2993 0.0000 6.4773 0.6775 0.2564 4.2196 10.2875 48.9379 0.0000 17.2562 11.6455 6.1644 15.3915 105.6014 0.0000 7.1505 7.2146 0.0024 76.6731 0.0000 0.0362 18.8801 101.3898 0.0191 797.1470 1.1427 5.5788 0.4479 33.6444 23.0658 17.2984 2.2440 0.1717 30.8099 12.0449 12.7640 0.7049 59.7734 0.1403 348.5082 63.3138 3.8823 0.1762 47.5589 12.2821 16.1211 3.0247 4.0543 0.0594
temp: 298.150 k
press: 1.00000 atm
elementType: 8 8 8 8 7 6 6 6 6 6 6 6 6 6 1 1 1 1 1 1 1 1 1
symmnumber: 1
zpe: 442610.5 jmol-1
zpe.correction: 0.168581 hartree
zpe.thermalcorrener: 0.182438 hartree
zpe.thermalcorrenthalpy: 0.183382 hartree
zpe.thermalcorrgfe: 0.126535 hartree
zpe.sumelectzpe: -702.973744 hartree
zpe.sumelectthermal: -702.959888 hartree
zpe.sumelectthermalent: -702.958943 hartree
zpe.sumelectthermalfe: -703.015790 hartree
dipole: 0.0000 0.9031 0.0004
dipole: 0.9031
quadrupole: -46.9104 -96.6204 -79.8654
quadrupole: 0.0000 -0.0052 -0.0012
quadrupole: 27.5550 -22.1550 -5.4000 0.0000 -0.0052 -0.0012
hfenergy: -703.1423255 hartree
pointgroup: C01 [X(C9H9N1O4)]
dipole: -0.000013 0.3553093 0.0001606 debye
dipolederiv: -1.6101599 0.101853 0.0003055 0.353896 -0.5253867 -0.0001644 0.0002531 -0.0000414 -0.2922086 -1.6101482 -0.101885 0.0001178 -0.3539288 -0.5253993 0.0000663 -0.000053 -0.0000149 -0.292209 -0.7316096 -0.1727223 0.00008 -0.0156709 -0.8982014 -0.0000352 0.0001272 -0.0001575 -0.3163685 -0.7316148 0.1727271 0.0000611 0.0156738 -0.8981942 -0.000108 0.000062 0.0000982 -0.3163689 -0.6788635 -0.0000067 0.0000799 -0.0000078 -0.2753003 0.0000033 0.0000475 0.000004 -0.2595817 -0.5250603 -0.0820443 0.0000934 -0.0048351 -0.3209061 -0.0000224 0.0001514 0.000043 0.0298955 -0.525065 0.0820403 0.0000692 0.0048329 -0.3209041 0.0000229 0.0001418 -0.0000514 0.0298958 0.2694656 0.0000026 -0.0000749 0.000003 0.0359774 -0.0000002 -0.0000152 -0.000003 -0.0490726 0.2789974 0.0069884 -0.0000689 0.035541 0.2630408 -0.0000167 -0.0000118 0.0000295 -0.0166333 0.279 -0.0069878 -0.000066 -0.0355412 0.2630396 -0.0000022 -0.000016 -0.0000264 -0.0166334 1.9881093 0.1451671 -0.0004087 -0.1983903 1.1676761 0.0001892 -0.0005247 0.0001537 0.2423089 1.9881099 -0.1451424 -0.000202 0.1984165 1.1676738 0.0000719 -0.000235 -0.0000081 0.2423086 0.7602194 0.0332432 -0.0000776 0.1155506 0.2269021 -0.0000233 -0.0000468 -0.0000284 0.2783862 0.7602237 -0.033228 -0.0000247 -0.1155364 0.2268974 -0.0000006 0.0000249 0.0000123 0.2783865 0.184365 0.0000019 -0.000005 0.0000018 0.0660351 0.0000034 0.0000131 0.0000017 0.1448456 0.0162203 0.0445233 0.0000233 0.0784546 0.1038454 -0.0000146 0.0000283 -0.0000414 0.1331538 0.0162237 -0.0445262 0.0000285 -0.0784573 0.1038415 0.0000153 0.0000427 0.0000324 0.133154 -0.0389324 0.0627347 0.0000256 0.1285999 -0.0135094 -0.000019 0.0000189 -0.0000107 0.1241124 -0.0126399 0.0026702 -0.0199957 -0.0969439 0.0415787 0.0975203 0.0348194 0.0838516 -0.0503623 -0.0126345 0.0026619 0.0200155 -0.0969443 0.041612 -0.0974712 -0.0348342 -0.0838254 -0.0503793 -0.0126494 -0.0026549 -0.0199867 0.0969517 0.0416105 -0.0974935 0.0348448 -0.083836 -0.0503936 -0.0126304 -0.0026812 0.0200187 0.0969334 0.0415853 0.0975003 -0.0348147 0.0838394 -0.0503486 -0.0389265 -0.062735 -0.0000083 -0.1285994 -0.0135142 -0.0000215 -0.0000236 -0.0000209 0.1241125 unknown
polarizability: 183.3724538|0.0009182|118.7333759|-0.0218759|0.0006441|56.6165478 unknown
InChI: InChI=1S/C9H9NO4/c1-13-8(11)6-3-7(5-10-4-6)9(12)14-2/h3-5H,1-2H3
charge 0 multiplicity 1
23 atoms
O  -3.606683 0.286369 0.00055
O  3.606659 0.286482 -0.000875
O  -2.59872 -1.816381 -0.000153
O  2.598758 -1.816298 -0.000671
N  -0.000046 2.322804 -0.000387
C  -1.216976 0.194215 -0.000052
C  1.216954 0.194256 -0.000632
C  0.0000 -0.525042 -0.000336
C  -1.166894 1.614206 -0.00011
C  1.166825 1.614244 -0.000635
C  -2.502301 -0.565956 0.000274
C  2.5023 -0.565875 -0.000931
C  -4.929955 -0.383486 0.000567
C  4.929951 -0.383333 -0.000822
H  0.000018 -1.619843 -0.000331
H  -2.092494 2.196659 0.000117
H  2.092406 2.196726 -0.000865
H  -5.658811 0.438223 0.000676
H  -5.036744 -1.013615 0.899276
H  -5.036852 -1.013472 -0.89823
H  5.036885 -1.013306 -0.899624
H  5.036737 -1.013473 0.89788
H  5.658782 0.438396 -0.000689
