program: Gaussian 09
title: 000078335
version: EM64L-G09RevD.01
frameworkgroup: C1[X(C9H18)]
method: RPBEPBE
basis: SDD
operation: Freq
keyword: #p
keyword: freq=noraman
keyword: PBEPBE/SDD
title: #p freq=noraman PBEPBE/SDD
converged: YES YES NO NO
title: Mulliken charges:
elementType: C C C C C C C C C H H H H H H H H H H H H H H H H H H
charge: -0.357079 -0.395319 -0.337777 -0.550619 -0.356003 0.556137 -0.695333 -0.824914 -0.741780 0.206956 0.184549 0.197371 0.200334 0.182749 0.182974 0.208812 0.202635 0.195339 0.194734 0.209121 0.214953 0.209060 0.221822 0.227234 0.226437 0.220086 0.217519
chargesum: 0.00000
title: Mulliken charges with hydrogens summed into heavy atoms:
elementType: C C C C C C C C C
charge: 0.034426 0.002387 0.027947 -0.139172 0.034071 0.556137 -0.062199 -0.149422 -0.304175
polarizability: 1.06930745e+02 -6.75158959e+00 9.41913791e+01 -3.03181068e+00 6.41887945e+00 9.05431626e+01
1716.lowfreq: -26.1109 -5.8034 0.0003 0.0005 0.0006 7.7377 41.7174 54.2399 57.1516
frequency: 41.0033 53.3962 57.0966 98.2774 130.8359 133.8191 167.5793 225.9724 236.8344 304.0248 345.6568 388.0854 419.4604 441.9122 545.8154 697.5755 718.8502 733.3639 775.8293 843.2238 863.6912 888.1182 936.8515 939.0263 967.4972 989.1412 1015.0026 1023.3717 1047.8736 1073.5533 1076.6463 1104.4788 1113.1218 1189.2904 1203.9767 1248.2767 1261.0464 1282.6882 1287.4033 1292.9338 1309.5408 1322.9989 1350.5180 1358.0659 1390.6786 1392.9700 1427.0986 1453.3168 1460.9494 1464.0269 1468.1573 1471.5981 1476.6916 1477.2372 1482.7896 1488.9150 1667.2311 2949.8560 2952.2946 2959.0813 2962.7398 2967.5136 2971.2380 2972.5830 2987.8034 3003.0234 3017.9209 3028.3419 3035.4878 3041.6489 3067.4546 3069.8397 3084.1646 3084.7004 3186.8226
redmass: 2.8584 2.3753 1.9091 2.6615 2.0073 2.1077 1.2029 1.1474 1.9975 2.6791 3.4006 2.0010 2.1290 2.7733 2.1406 1.0627 1.1535 1.3808 1.6014 1.4868 1.6719 1.8812 1.5147 1.3291 1.3027 1.6267 1.5995 2.9462 1.6304 2.1959 2.1216 1.6063 2.1434 1.5300 1.3980 1.3606 1.2702 1.0903 1.4444 1.4469 1.2832 1.5433 1.5576 1.6369 1.2191 1.2402 1.1720 1.0753 1.0818 1.0715 1.0640 1.0681 1.0546 1.0571 1.0755 1.0897 4.9788 1.0591 1.0611 1.0603 1.0402 1.0577 1.0381 1.0584 1.0968 1.0995 1.1019 1.1005 1.0968 1.1027 1.1006 1.0993 1.0906 1.0698 1.1138
irintensity: 0.0572 0.0901 0.0618 0.0123 0.0139 0.0161 0.5999 0.0056 0.0752 1.2746 0.2046 1.5762 1.3332 3.5658 7.2882 1.0478 10.6141 0.6012 0.9681 2.6118 0.3536 4.8758 0.1938 82.6509 0.1532 1.7323 2.3274 0.7568 10.7679 5.7340 0.3517 3.8966 3.8468 0.1637 0.5907 1.1253 1.4370 0.9837 5.7509 0.7914 0.8866 1.6517 1.0159 0.0932 11.9141 24.3558 0.9435 2.6646 10.5808 0.2213 13.5354 10.1809 16.8974 7.2494 3.1108 15.9475 25.7629 7.1712 28.4368 8.5626 16.2826 27.4505 28.5079 136.5705 2.0653 2.7816 8.0859 14.2850 36.6269 125.8107 97.4728 52.7180 35.2872 2.6268 27.9225
temp: 298.150 k
press: 1.00000 atm
elementType: 6 6 6 6 6 6 6 6 6 1 1 1 1 1 1 1 1 1 1 1 1 1 1 1 1 1 1
symmnumber: 1
zpe: 645791.4 jmol-1
zpe.correction: 0.245969 hartree
zpe.thermalcorrener: 0.258062 hartree
zpe.thermalcorrenthalpy: 0.259006 hartree
zpe.thermalcorrgfe: 0.206972 hartree
zpe.sumelectzpe: -352.982780 hartree
zpe.sumelectthermal: -352.970688 hartree
zpe.sumelectthermalent: -352.969744 hartree
zpe.sumelectthermalfe: -353.021778 hartree
dipole: -0.2290 0.4500 0.3508
dipole: 0.6148
quadrupole: -62.4512 -58.6980 -57.5701
quadrupole: 0.2324 1.8921 -0.6210
quadrupole: -2.8781 0.8751 2.0030 0.2324 1.8921 -0.6210
hfenergy: -353.2287494 hartree
pointgroup: C01 [X(C9H18)]
dipole: 0.0916433 0.1864836 -0.1238483 debye
polarizability: 107.0214827|6.9381234|95.0676799|-2.4505001|-6.0245987|89.5761242 unknown
InChI: InChI=1S/C9H18/c1-4-5-6-7-8-9(2)3/h2,4-8H2,1,3H3
charge 0 multiplicity 1
27 atoms
C  0.631017 0.134201 0.422209
C  -0.382193 1.265388 0.140415
C  2.050075 0.444098 -0.105149
C  -1.821474 0.952892 0.641997
C  3.071516 -0.676763 0.195152
C  -2.482243 -0.244887 -0.033147
C  4.481332 -0.374242 -0.357008
C  -2.660856 -0.16329 -1.540132
C  -2.908651 -1.322884 0.678662
H  0.265774 -0.809776 -0.030909
H  0.676014 -0.049508 1.51635
H  -0.403045 1.479996 -0.94759
H  -0.034861 2.197957 0.630141
H  2.004841 0.612526 -1.202022
H  2.411547 1.395762 0.338905
H  -1.79352 0.788647 1.736738
H  -2.451434 1.851306 0.467077
H  2.701023 -1.630094 -0.234205
H  3.127561 -0.832699 1.291948
H  4.885776 0.559774 0.077436
H  5.191704 -1.189394 -0.125927
H  4.457299 -0.248059 -1.456097
H  -3.20098 0.761344 -1.824697
H  -1.683868 -0.132501 -2.061132
H  -3.225077 -1.027916 -1.92948
H  -2.778487 -1.380459 1.766114
H  -3.400691 -2.175919 0.195949
