program: Gaussian 09
title: 000078340
version: EM64L-G09RevD.01
frameworkgroup: C1[X(C11H13NO4)]
method: RPBEPBE
basis: SDD
operation: Freq
keyword: #p
keyword: freq=noraman
keyword: PBEPBE/SDD
title: #p freq=noraman PBEPBE/SDD
converged: YES YES NO NO
title: Mulliken charges:
elementType: O O O O N C C C C C C C C C C C H H H H H H H H H H H H H
charge: -0.284563 -0.284565 -0.242829 -0.242829 0.005117 0.238228 0.238228 -0.339221 -0.412990 -0.412990 0.173428 0.173427 -0.220892 -0.220892 -0.671760 -0.671759 0.314319 0.286098 0.286097 0.233591 0.233570 0.233596 0.233565 0.215937 0.231036 0.231041 0.215937 0.231037 0.231040
chargesum: 0.00000
title: Mulliken charges with hydrogens summed into heavy atoms:
elementType: O O O O N C C C C C C C C C C C
charge: -0.284563 -0.284565 -0.242829 -0.242829 0.005117 0.238228 0.238228 -0.024902 -0.126892 -0.126893 0.173428 0.173427 0.246269 0.246269 0.006254 0.006254
polarizability: 1.86040816e+02 1.34145020e-04 1.67149071e+02 2.25435862e-02 3.53041499e-03 7.45721726e+01
1716.lowfreq: -8.2483 -3.5579 -3.4834 -0.0008 -0.0006 0.0009 17.5777 32.3335 53.1498
frequency: 17.5142 32.3335 53.1498 59.1030 65.4861 84.7114 104.7088 106.8944 176.1714 190.0608 203.1325 242.4979 246.0028 270.6346 305.8789 313.9023 342.9459 379.4584 424.3749 429.5954 441.4980 527.9762 634.2457 678.0410 709.4536 725.1134 743.1793 780.2557 797.9619 798.1485 814.2063 827.2488 910.2975 943.7598 979.3002 984.6346 1006.9360 1018.2609 1021.4375 1058.7810 1070.3238 1112.3053 1112.7575 1135.7662 1135.8597 1163.2882 1192.8660 1249.4109 1249.5256 1278.0317 1305.3188 1315.8845 1357.3164 1359.9503 1400.2241 1400.6854 1418.8898 1424.3482 1462.8600 1463.0735 1472.4215 1473.2033 1484.9735 1485.9296 1548.9203 1582.6587 1621.2339 1626.0748 2998.1184 2998.2225 3013.3727 3013.4405 3072.5109 3072.5339 3094.3938 3094.6521 3110.3350 3110.4708 3153.3187 3157.6078 3197.1351
redmass: 3.2233 2.7235 3.8806 3.4214 7.7389 2.6098 2.5623 4.1398 2.4457 2.4891 4.7250 1.4236 1.4996 5.7783 6.3365 4.3427 5.3769 4.4602 5.0900 4.6077 5.3732 5.5697 9.0573 8.4854 9.3413 2.2457 7.9327 7.8742 1.1003 1.1081 3.7124 3.9793 6.7570 1.6690 1.5240 1.4053 5.0796 2.3908 2.2970 8.9038 2.8916 2.2442 2.2467 1.4672 1.4670 2.2368 2.1669 1.1325 1.1326 3.3994 1.3088 8.9845 1.3691 1.4475 1.2644 1.2702 3.0487 2.7303 1.0400 1.0400 1.0597 1.0623 1.0712 1.0687 6.0308 6.4567 10.8046 11.7262 1.0358 1.0358 1.0582 1.0582 1.1067 1.1067 1.0985 1.0984 1.1028 1.1028 1.0903 1.0952 1.0934
irintensity: 0.0000 0.0073 0.0612 0.0000 2.0786 1.0609 0.0000 0.3713 7.7040 0.0000 8.9160 0.0000 4.4042 2.1137 0.5856 3.4864 16.5593 5.0034 0.0000 4.3632 3.3437 4.5726 0.1796 3.9696 11.4346 46.8007 0.0000 2.3766 6.8341 0.0000 3.9664 1.8155 14.4006 17.6463 0.0000 4.7421 74.5003 11.6240 68.3188 378.0467 88.4338 0.5437 2.2912 0.0001 12.0870 49.4836 304.9147 0.0002 0.0363 392.1992 2.1651 5.9875 2.6280 4.5832 1.5161 38.8255 4.1553 0.2630 0.0001 25.7502 1.9439 9.2705 24.8744 0.8604 17.8551 2.3997 334.9222 116.4756 0.0009 36.1247 35.9536 0.0064 0.0374 13.1062 57.0721 1.8693 0.0005 84.8351 1.8012 0.0004 1.4986
temp: 298.150 k
press: 1.00000 atm
elementType: 8 8 8 8 7 6 6 6 6 6 6 6 6 6 6 6 1 1 1 1 1 1 1 1 1 1 1 1 1
symmnumber: 1
zpe: 588799.0 jmol-1
zpe.correction: 0.224262 hartree
zpe.thermalcorrener: 0.240846 hartree
zpe.thermalcorrenthalpy: 0.241790 hartree
zpe.thermalcorrgfe: 0.177146 hartree
zpe.sumelectzpe: -781.432342 hartree
zpe.sumelectthermal: -781.415758 hartree
zpe.sumelectthermalent: -781.414814 hartree
zpe.sumelectthermalfe: -781.479458 hartree
dipole: 0.0000 -5.9907 -0.0005
dipole: 5.9907
quadrupole: -93.2604 -95.4307 -92.2957
quadrupole: 0.0000 -0.0089 -0.0022
quadrupole: 0.4019 -1.7685 1.3666 0.0000 -0.0089 -0.0022
hfenergy: -781.6566039 hartree
pointgroup: C01 [X(C11H13N1O4)]
dipole: -0.0000843 -2.3569093 0.0001717 debye
polarizability: 186.040781|-0.0008293|167.1490709|0.0662072|-0.0032404|74.5722074 unknown
InChI: InChI=1S/C11H13NO4/c1-3-15-10(13)8-5-9(7-12-6-8)11(14)16-4-2/h5-7H,3-4H2,1-2H3
charge 0 multiplicity 1
29 atoms
O  -2.441048 -1.090302 -0.000948
O  2.44097 -1.090479 0.001599
O  -3.653877 0.903243 -0.00245
O  3.653941 0.902982 0.002466
N  0.000111 3.094501 0.000093
C  -1.215408 0.963352 -0.000965
C  1.215475 0.963263 0.001545
C  0.000007 0.240524 0.000357
C  -1.164311 2.383233 -0.001021
C  1.164479 2.38315 0.001333
C  -2.553067 0.299942 -0.002367
C  2.553087 0.29976 0.003062
C  -3.731898 -1.850005 -0.000832
C  3.731769 -1.850272 0.001046
C  -3.370522 -3.330766 0.000714
C  3.370292 -3.331009 -0.00052
H  -0.000032 -0.851171 0.000477
H  -2.09653 2.957896 -0.002102
H  2.096741 2.957745 0.002299
H  -4.306937 -1.549225 0.893362
H  -4.306096 -1.550881 -0.89612
H  4.306574 -1.549457 -0.893286
H  4.30624 -1.551262 0.896197
H  -4.293604 -3.938413 0.000844
H  -2.782254 -3.595163 -0.894322
H  -2.783091 -3.5935 0.896788
H  4.293334 -3.938716 -0.000957
H  2.782259 -3.595439 0.89466
H  2.782596 -3.593631 -0.896454
