program: Gaussian 09
title: 000078330
version: EM64L-G09RevD.01
frameworkgroup: C1[X(C11H12N2O)]
method: RPBEPBE
basis: SDD
operation: Freq
keyword: #p
keyword: freq=noraman
keyword: PBEPBE/SDD
title: #p freq=noraman PBEPBE/SDD
converged: YES YES NO NO
title: Mulliken charges:
elementType: O N N C C C C C C C C C C C H H H H H H H H H H H H
charge: -0.245176 -0.285808 -0.022908 -0.505627 -0.525391 0.205563 0.185254 0.403124 -0.777547 -0.342904 -0.373071 -0.228427 -0.211658 -0.249763 0.246170 0.242776 0.244137 0.264920 0.230740 0.254764 0.233642 0.301843 0.282067 0.224134 0.222815 0.226331
chargesum: 0.00000
title: Mulliken charges with hydrogens summed into heavy atoms:
elementType: O N N C C C C C C C C C C C
charge: -0.245176 -0.285808 -0.022908 -0.016681 -0.016334 0.205563 0.185254 0.403124 -0.058401 -0.041061 -0.091005 -0.004293 0.011157 -0.023431
polarizability: 1.97891066e+02 -1.72774486e+00 1.43002840e+02 -6.29754744e-01 5.22814448e+00 6.98834109e+01
1716.lowfreq: -6.1183 -2.4219 -0.0008 -0.0003 0.0004 2.0585 18.5900 58.6512 101.5422
frequency: 18.2861 58.6282 101.5353 144.6498 173.9389 182.6775 230.2951 293.0638 319.7668 372.9302 376.4797 408.8150 426.8912 455.1877 508.3794 531.4979 566.1000 609.3368 620.6059 669.8689 697.4930 730.2298 770.4053 785.3759 829.4612 851.1211 930.1296 948.1110 971.5324 984.2185 985.9149 987.5283 996.3370 1029.7112 1039.4999 1054.1132 1074.6988 1100.1175 1148.1028 1153.0128 1170.9470 1189.2528 1223.5180 1253.7197 1293.5610 1311.9269 1323.6124 1364.1147 1381.4962 1393.5182 1442.3766 1447.3297 1450.3830 1454.8308 1461.9233 1477.7807 1585.2952 1598.5819 1608.7376 1621.4602 2970.2834 2974.3281 2991.2438 3046.9819 3059.7775 3097.2320 3115.2030 3126.5667 3138.4658 3160.1436 3201.1375 3213.0016
redmass: 4.0615 3.6664 4.6138 2.6061 2.4679 1.3005 3.0402 4.4975 4.1887 5.3545 3.7867 2.9478 2.5562 5.6299 3.1576 5.0204 4.1278 5.4396 5.6916 5.1615 2.0709 3.8297 1.6886 2.5292 3.4335 1.2465 1.4285 2.1264 1.7051 1.6640 3.8548 2.7821 1.3493 2.1460 1.8036 1.8104 2.3001 1.9104 2.7865 1.2518 1.0574 1.1718 1.7273 2.3211 2.5813 1.5815 1.4263 2.0806 9.8153 1.3188 2.2775 1.0979 1.0946 1.0841 1.0522 2.2462 6.4838 9.5372 6.3645 6.7697 1.0589 1.0464 1.0658 1.0969 1.0948 1.0951 1.0981 1.0852 1.0913 1.0988 1.0931 1.0940
irintensity: 0.5062 6.7835 0.4986 0.3730 2.3712 1.1300 1.0401 2.1596 8.3281 2.1727 3.0633 0.2553 4.4420 4.4928 10.2475 14.8238 6.5735 3.0593 1.2356 6.9549 40.8555 22.8290 76.0088 0.0104 3.0983 0.2465 9.2620 4.7467 8.4436 0.2240 6.2105 23.7913 3.1910 10.3522 19.7695 4.7289 13.2352 36.6185 44.9474 2.1899 0.9396 14.3223 40.0374 47.7267 169.8046 1.5098 9.4077 5.4322 0.9140 21.1336 7.2609 15.4745 21.5839 17.0347 11.7149 125.6398 17.9785 187.2770 54.7564 11.1688 6.5003 36.5373 16.4541 15.1519 26.9897 7.8430 11.6574 0.2004 26.1755 35.6093 2.6372 6.7557
temp: 298.150 k
press: 1.00000 atm
elementType: 8 7 7 6 6 6 6 6 6 6 6 6 6 6 1 1 1 1 1 1 1 1 1 1 1 1
symmnumber: 1
zpe: 546004.2 jmol-1
zpe.correction: 0.207962 hartree
zpe.thermalcorrener: 0.220138 hartree
zpe.thermalcorrenthalpy: 0.221083 hartree
zpe.thermalcorrgfe: 0.168474 hartree
zpe.sumelectzpe: -610.069905 hartree
zpe.sumelectthermal: -610.057728 hartree
zpe.sumelectthermalent: -610.056784 hartree
zpe.sumelectthermalfe: -610.109393 hartree
dipole: 3.8833 -2.2189 0.4654
dipole: 4.4967
quadrupole: -62.6471 -85.9086 -84.1054
quadrupole: -0.2050 -0.1088 1.9586
quadrupole: 14.9066 -8.3549 -6.5517 -0.2050 -0.1088 1.9586
hfenergy: -610.2778666 hartree
pointgroup: C01 [X(C11H12N2O1)]
dipole: 1.5067703 0.8930437 -0.2489302 debye
dipolederiv: -0.5357307 -0.2839792 0.0455861 -0.0057001 -1.1874509 0.1516542 -0.0629293 0.1096277 -0.3509159 -0.9533664 0.4126397 -0.0835425 -0.2065602 -1.1143855 0.2017607 -0.1405313 0.1322356 -0.1089271 -0.1566292 0.197559 -0.0339336 0.7928521 0.1883948 -0.097748 0.1142107 0.0326462 -0.1757498 -0.0042247 0.0558828 0.0481614 0.058481 -0.2215757 0.011274 0.0757297 0.0129397 0.144994 -0.2775377 -0.0040218 -0.0271577 -0.0256651 0.0556912 0.0098337 -0.0677268 0.003404 0.1047456 0.318957 -0.0130026 -0.0748682 -0.0183705 0.4439858 0.0567919 -0.1657279 0.017701 -0.0077229 0.6653757 -0.1886203 0.138917 -0.3330525 1.6641389 -0.2832972 0.2001226 -0.22137 0.2083597 1.2672235 -0.1450865 0.0219695 -0.18967 0.006873 0.0400683 0.0342677 -0.0262876 0.0742365 -0.1381974 -0.1247764 0.0204355 -0.0521099 -0.1393262 0.007767 0.0211417 0.0045354 0.0587258 -0.3326717 -0.0215808 0.0019915 -0.0941041 -0.0482859 0.0143667 0.00756 -0.0061467 -0.1529294 -0.222415 0.0844968 -0.002238 0.1874242 -0.063907 0.0123448 -0.0044524 0.0113658 -0.1621065 0.0962672 0.0806595 0.0206288 0.0765467 0.080584 0.0494354 0.0361071 0.0278031 -0.1527728 0.0225604 -0.0490779 0.0110605 -0.0899269 0.1445061 0.0398056 -0.0070827 0.037528 -0.1558438 -0.0116364 -0.0117889 0.0084246 0.0027171 -0.0913615 0.0027124 0.0136693 0.0077717 -0.1718724 0.0974754 -0.0192261 -0.0323395 0.0638934 0.0642953 -0.0284275 0.0369923 -0.0234022 -0.0993854 -0.1641507 -0.0390867 -0.0144401 -0.0584431 0.0879838 -0.0088306 -0.0571311 0.0038867 0.092639 0.0316932 -0.0026335 -0.0138486 -0.0521794 0.0929744 -0.0546986 -0.0300712 0.0086764 -0.0894011 0.0532703 0.0284384 0.0122366 0.0695057 -0.0671174 -0.0130809 0.0393195 -0.0303213 0.1043213 -0.0360397 -0.0452508 -0.1039842 -0.0518985 0.0502674 0.0331001 -0.1409399 -0.028023 -0.0062365 0.0426187 0.1384295 0.0111793 0.0575271 -0.0259698 -0.0044637 0.0102866 -0.0209011 0.1156811 0.0317945 -0.0345904 0.0963259 -0.0559682 0.0608815 -0.0181687 0.130995 0.0355227 -0.0656981 0.1881544 0.0433685 0.007192 0.0032225 0.0463103 -0.0275082 0.0225371 -0.0072707 0.1737451 0.1458592 -0.0712217 -0.0213447 -0.0973789 0.0294926 -0.019987 -0.0247505 -0.0172858 0.1606498 -0.0200941 -0.0910414 -0.0247204 -0.1163354 -0.0377868 -0.0352127 -0.0332922 -0.0301384 0.147523 0.0397461 0.0649876 0.0026551 0.0937789 -0.1067837 -0.0312422 0.0078429 -0.0288867 0.1499848 -0.1483019 0.0385233 -0.0143464 0.0414141 0.0875714 -0.0082495 -0.0161469 -0.0056103 0.1639561 unknown
polarizability: 197.7729827|3.0877423|143.489766|0.5660729|-0.42288|69.5145677 unknown
InChI: InChI=1S/C11H12N2O/c1-9-7-8-11(14)13(12-9)10-5-3-2-4-6-10/h2-6H,7-8H2,1H3
charge 0 multiplicity 1
26 atoms
O  0.419985 -2.548897 0.435053
N  0.418215 -0.203671 0.128062
N  1.151372 1.030461 0.090583
C  3.208302 -0.299123 -0.339318
C  2.56239 -1.389169 0.533301
C  2.443664 0.995266 -0.138774
C  1.046253 -1.4536 0.345552
C  -1.020733 0.001958 0.071575
C  3.167435 2.316813 -0.209713
C  -1.922045 -1.076074 -0.141463
C  -1.531626 1.31999 0.216595
C  -3.31053 -0.823939 -0.199956
C  -2.921055 1.550893 0.156992
C  -3.823542 0.483067 -0.051639
H  3.15777 -0.58382 -1.411442
H  4.27631 -0.165661 -0.095138
H  2.75962 -1.180931 1.604289
H  2.958765 -2.39304 0.315045
H  3.926361 2.39494 0.592648
H  2.458475 3.153625 -0.112388
H  3.706789 2.410886 -1.172159
H  -1.543795 -2.092643 -0.240538
H  -0.834613 2.144434 0.369202
H  -3.991987 -1.666465 -0.36353
H  -3.2967 2.573675 0.27501
H  -4.902479 0.666625 -0.097953
