program: Gaussian 09
title: 000078341
version: EM64L-G09RevD.01
frameworkgroup: C1[X(C8H15NO)]
method: RPBEPBE
basis: SDD
operation: Freq
keyword: #p
keyword: freq=noraman
keyword: PBEPBE/SDD
title: #p freq=noraman PBEPBE/SDD
converged: YES YES NO NO
title: Mulliken charges:
elementType: O N C C C C C C C C H H H H H H H H H H H H H H H
charge: -0.297626 -0.092331 -0.010154 -0.390472 -0.396247 -0.410191 -0.404541 -0.725108 0.232682 -0.795411 0.193123 0.200050 0.200327 0.207002 0.201258 0.233238 0.210522 0.206836 0.266727 0.212538 0.211699 0.215662 0.233332 0.230512 0.266575
chargesum: 0.00000
title: Mulliken charges with hydrogens summed into heavy atoms:
elementType: O N C C C C C C C C
charge: -0.297626 -0.092331 0.182969 0.009905 0.012013 0.033569 0.069022 -0.085210 0.232682 -0.064993
polarizability: 1.15538364e+02 -1.65546873e+00 9.25955650e+01 -4.75695666e+00 1.15994618e+00 7.52473605e+01
1716.lowfreq: -24.2380 -14.5521 0.0002 0.0003 0.0005 12.8278 39.7604 98.3794 161.4220
frequency: 39.7299 98.3257 161.3967 168.3159 176.9365 217.4663 279.8695 310.9774 333.5408 346.4917 433.0493 451.5619 463.1773 539.7606 566.5674 596.2596 696.9610 778.5120 802.4617 885.7630 927.7697 952.2984 960.1279 967.7478 996.0266 1014.8565 1028.7987 1056.4008 1093.5012 1132.6811 1147.6590 1156.4133 1206.7046 1233.5694 1256.8875 1263.5666 1297.2705 1306.1265 1331.6858 1341.1548 1349.6104 1362.0986 1375.6696 1390.0440 1420.7157 1449.1581 1450.8440 1461.4376 1468.7188 1472.7059 1475.0286 1478.7746 1484.9285 1590.6198 2939.7719 2942.7413 2953.3797 2968.6052 2973.1582 2980.3722 2987.2781 3035.6812 3042.7258 3064.3216 3068.6647 3073.2466 3085.2957 3093.2349 3129.6035
redmass: 4.0873 3.4750 1.6772 2.7062 1.2995 1.0691 2.0680 2.6166 3.8133 2.2546 1.9329 2.7056 2.9238 3.3297 3.2968 2.8244 3.1421 2.2764 1.5373 2.0541 2.0425 1.3837 1.4515 2.0890 1.9556 1.6724 1.6578 1.9441 2.5202 2.1997 1.7212 1.5547 2.3629 1.5673 1.2911 1.7490 1.3410 1.3182 1.2630 1.4343 1.5589 1.4281 1.2179 1.2178 3.0260 1.0908 1.0908 1.0909 1.0769 1.0865 1.0491 1.0584 1.0759 6.3674 1.0811 1.0728 1.0697 1.0371 1.0587 1.0598 1.0383 1.1022 1.1021 1.0991 1.0993 1.0985 1.0928 1.0904 1.0977
irintensity: 0.6596 4.3394 1.5706 0.9170 1.3262 0.0655 0.7298 3.3230 2.4593 4.8200 1.0873 2.3446 1.4994 6.2991 4.7564 4.2657 1.5124 0.0410 0.1899 1.3757 3.6915 13.3380 5.9838 41.6844 1.0763 6.1686 4.5298 10.1153 8.6747 0.1866 5.3192 3.9968 4.3807 98.7142 3.9049 35.1691 29.3234 2.6697 0.5641 0.3616 10.0004 12.7030 24.9963 9.6353 139.5847 4.2696 39.7347 10.9784 13.5163 38.0277 14.0043 6.4180 3.8788 284.0196 3.6970 51.8334 61.2156 25.3702 42.2255 46.6854 9.5158 36.7673 48.0700 70.7131 40.8060 19.0633 7.4442 22.7552 10.9135
temp: 298.150 k
press: 1.00000 atm
elementType: 8 7 6 6 6 6 6 6 6 6 1 1 1 1 1 1 1 1 1 1 1 1 1 1 1
symmnumber: 1
zpe: 577717.4 jmol-1
zpe.correction: 0.220041 hartree
zpe.thermalcorrener: 0.230686 hartree
zpe.thermalcorrenthalpy: 0.231630 hartree
zpe.thermalcorrgfe: 0.184002 hartree
zpe.sumelectzpe: -443.033109 hartree
zpe.sumelectthermal: -443.022463 hartree
zpe.sumelectthermalent: -443.021519 hartree
zpe.sumelectthermalfe: -443.069147 hartree
dipole: -3.1016 3.0949 1.0493
dipole: 4.5055
quadrupole: -69.0962 -62.7211 -61.4176
quadrupole: 9.4075 1.0189 -1.4677
quadrupole: -4.6846 1.6905 2.9940 9.4075 1.0189 -1.4677
hfenergy: -443.2531495 hartree
pointgroup: C01 [X(C8H15N1O1)]
dipole: -1.2507486 1.112952 0.5822812 debye
dipolederiv: -0.9178094 0.1231234 0.1976256 0.4715845 -0.8315528 -0.2160345 0.3058521 -0.1108148 -0.4665162 -1.2861048 0.0791361 0.2857381 -0.0922902 -0.492776 0.0102971 0.2602112 -0.0495732 -0.4449968 0.1000872 0.0078347 -0.0386773 0.0260668 0.0780855 -0.0131693 -0.0817853 -0.0114535 0.1549 -0.0353849 -0.0134072 -0.0422377 -0.0040154 0.0435634 0.000684 -0.0425547 -0.0138431 0.0967943 -0.0131762 0.0192744 -0.0440569 -0.005898 0.0653013 -0.0002889 -0.0380984 0.0099928 0.0987586 0.2743835 -0.1716306 -0.0550221 -0.3034766 0.2845894 0.1037736 -0.0452128 0.0904348 0.3690249 0.1693079 0.1545021 0.0188129 0.3582339 0.2695603 -0.1341253 0.0861397 -0.0932103 0.2894446 -0.0549967 0.0021446 -0.0605231 -0.0045962 0.0620375 0.0005513 -0.0257329 0.0012194 0.0749099 1.6798143 -0.0944065 -0.5857848 -0.1803739 0.8979506 0.15147 -0.7148217 0.1350826 0.3804471 -0.1035974 -0.1424267 0.0508705 -0.2245223 -0.3054904 0.0433451 0.0644453 0.0214115 0.0614234 0.0335671 -0.0007276 -0.0061253 -0.0068161 0.0169384 0.0252183 0.0392431 0.0253179 -0.2094684 -0.0424843 0.1236433 0.0521384 0.1004216 -0.1191902 -0.0647706 0.046997 -0.0904406 0.045823 0.043157 -0.0290728 0.0156975 -0.0225735 0.0597911 0.0063611 0.0039685 0.0675323 -0.1583643 0.0454114 0.0237306 0.0160993 0.0252322 0.0644928 0.0532316 0.0017581 -0.0092298 -0.1574179 -0.0418838 -0.1316725 0.0227327 -0.1064117 -0.1406323 0.0173685 0.0234481 0.04152 0.0754789 -0.0150377 -0.1047938 -0.0078765 -0.0840902 -0.0792348 0.0012789 0.0097065 0.0335948 0.0773469 -0.0059041 0.058503 0.0590246 0.0691777 0.038192 0.0421267 0.0632332 -0.0525994 -0.2061977 0.0054529 -0.0671216 0.0438895 -0.0884847 0.0414183 0.0101826 0.0253383 0.0900456 -0.1896841 0.076182 0.1133677 -0.001476 0.0189447 0.0123186 -0.011321 -0.0131081 -0.0582294 0.0887245 -0.0280876 0.0961377 0.0168061 0.1684283 -0.0746226 -0.0606088 0.0463141 -0.0749443 0.0541586 0.0631586 -0.0089875 0.0779948 0.0021181 0.0861242 0.0296242 -0.0102005 0.0286965 -0.1583575 -0.0212984 -0.0952312 -0.0050191 -0.1711702 -0.0984656 0.0248614 0.0064412 0.0380316 0.0789549 0.1108214 -0.0183007 0.0140927 -0.03817 0.0277142 -0.0582174 -0.0273232 -0.0968348 -0.0828102 0.0200228 0.082223 -0.097347 0.0311572 -0.0085912 0.0671938 -0.0700057 0.0805626 0.0387059 -0.0556011 -0.0058419 0.0726231 0.061524 0.1024783 -0.0290326 0.0857468 -0.0022693 0.0889176 unknown
polarizability: 115.0829558|0.0384985|92.157346|-6.751164|2.5469914|76.1409879 unknown
InChI: InChI=1S/C8H15NO/c1-7-3-5-9(6-4-7)8(2)10/h7H,3-6H2,1-2H3
charge 0 multiplicity 1
25 atoms
O  2.586148 -1.10656 -0.742527
N  0.754152 -0.038019 0.216862
C  -2.190253 -0.062721 0.189686
C  -1.37388 1.242548 0.005262
C  -1.34911 -1.270241 -0.298214
C  0.013698 1.149297 0.685517
C  0.033664 -1.319521 0.388707
C  -3.554516 0.011077 -0.526875
C  2.024253 -0.031581 -0.356513
C  2.726917 1.320464 -0.509657
H  -2.37211 -0.195297 1.279782
H  -1.928743 2.103774 0.42725
H  -1.236523 1.43509 -1.078173
H  -1.207202 -1.200353 -1.395333
H  -1.888978 -2.21607 -0.096197
H  0.599399 2.060136 0.488447
H  -0.126432 1.075959 1.786398
H  -0.095719 -1.515814 1.474792
H  0.674155 -2.110858 -0.033003
H  -4.157656 0.863517 -0.161792
H  -3.418126 0.13614 -1.61832
H  -4.140266 -0.913141 -0.365535
H  2.882336 1.820605 0.463758
H  2.161953 2.009792 -1.163753
H  3.707939 1.126778 -0.967368
