program: Gaussian 09
title: 000078360
version: EM64L-G09RevD.01
frameworkgroup: C1[X(C15H30O3)]
method: RPBEPBE
basis: SDD
operation: Freq
keyword: #pfreq=noraman
keyword: PBEPBE/SDD
title: #p freq=noraman PBEPBE/SDD
converged: YES YES NO NO
title: Mulliken charges:
elementType: O O O C C C C C C C C C C C C C C C H H H H H H H H H H H H H H H H H H H H H H H H H H H H H H
charge: -0.452724 -0.418127 -0.231135 -0.386357 -0.385952 -0.386149 -0.385589 -0.384273 -0.382984 -0.385196 -0.375858 -0.368867 -0.377640 -0.376306 -0.365424 -0.487956 -0.342521 0.170607 0.193768 0.193769 0.193717 0.193706 0.194319 0.194325 0.193955 0.193957 0.193310 0.193316 0.192504 0.192504 0.196308 0.196324 0.194789 0.194774 0.191344 0.191303 0.189058 0.189091 0.217638 0.217973 0.213574 0.213606 0.252178 0.252258 0.187010 0.187002 0.340119 0.374950
chargesum: 0.00000
title: Mulliken charges with hydrogens summed into heavy atoms:
elementType: O O O C C C C C C C C C C C C C C C
charge: -0.112605 -0.043177 -0.231135 0.001180 0.001471 0.002495 0.002323 0.002353 0.002024 0.007435 0.013705 0.013780 0.000509 0.059306 0.061757 0.016480 0.031492 0.170607
polarizability: 2.41430829e+02 1.42766220e+00 1.53368238e+02 -6.25516669e-03 -7.39720386e-03 1.31396046e+02
1716.lowfreq: -2.4181 -0.0021 -0.0008 0.0015 6.2301 12.1526 16.2898 16.4154 32.1987
frequency: 15.4322 16.3186 30.1326 35.0592 46.4554 53.1649 61.4635 76.4468 88.9868 89.3736 101.8603 118.0929 121.6750 127.1011 143.9351 145.3658 148.7640 161.7292 163.2544 202.5541 246.2738 270.9202 274.0373 344.2405 358.3929 418.9358 444.2414 479.6410 500.0860 501.2726 513.2756 588.5491 634.8035 723.0797 724.0500 726.6631 734.7601 749.6578 770.9861 797.9194 832.0703 856.6325 871.9628 915.9380 957.6976 960.6159 973.6242 982.7151 995.5752 1002.0128 1014.8464 1022.3488 1034.6787 1043.7302 1052.7816 1066.2341 1077.6099 1080.2652 1082.6828 1083.2847 1084.5395 1109.2706 1117.3598 1149.9231 1187.1805 1191.5550 1206.4302 1210.0733 1227.4595 1228.2616 1241.3123 1250.0183 1256.7576 1269.3484 1275.3718 1278.7108 1280.9496 1286.5206 1288.3409 1295.1200 1295.7376 1297.1244 1301.7847 1302.7001 1315.0084 1333.1374 1347.7753 1355.3083 1357.0048 1359.0886 1360.7492 1372.7880 1414.0669 1438.1117 1460.8692 1460.9477 1463.3187 1463.9193 1465.5419 1468.0338 1469.7706 1473.6743 1478.3515 1482.7104 1486.6716 1489.8006 1492.0915 1669.4321 2926.4197 2950.0472 2950.1745 2951.3905 2952.2434 2952.9002 2953.5313 2956.3253 2960.7917 2964.9839 2967.6149 2973.7153 2983.1844 2985.4938 2986.7252 2988.5939 2992.0356 2992.4917 2996.3291 2997.7025 3005.9650 3016.6214 3026.4030 3031.5549 3037.7110 3044.1781 3059.2350 3062.5122 3512.7974 3564.7585
redmass: 5.5676 5.5415 4.9280 3.5704 4.9580 2.5535 2.1533 1.8853 2.5084 4.6419 1.8275 2.3843 6.1166 1.8740 2.2278 4.3012 1.9412 2.1105 2.0010 4.4363 4.7756 1.0878 4.0913 3.5905 4.6135 3.3391 4.0113 3.1966 1.7617 3.3325 3.0815 4.6618 1.3317 1.0594 1.0673 1.0862 1.1085 1.1370 1.1668 1.2049 1.2507 4.8587 1.2747 1.2703 7.6269 1.2361 4.8902 5.1478 4.0291 1.1692 3.5248 3.8286 1.0725 2.8575 3.2404 2.7534 2.5704 2.0364 2.3120 2.2477 2.4331 4.1471 1.4403 1.3775 1.7880 1.1938 1.5485 1.2941 1.3375 1.4167 1.3846 1.3282 1.3729 1.2532 1.3577 1.0233 1.0865 1.1138 1.0808 1.3654 1.0912 1.1234 1.1040 1.1163 1.3967 1.4414 1.4974 1.7275 1.5709 1.6725 1.6232 1.8389 1.4397 1.0844 1.0719 1.0742 1.0675 1.0745 1.0654 1.0768 1.0823 1.0933 1.0947 1.0962 1.0983 1.0998 1.0981 8.2256 1.0544 1.0586 1.0583 1.0587 1.0592 1.0590 1.0590 1.0597 1.0594 1.0589 1.0583 1.1065 1.0959 1.0967 1.0612 1.0978 1.0591 1.0994 1.0596 1.1014 1.1033 1.1045 1.1037 1.1013 1.1047 1.1046 1.1048 1.1032 1.0639 1.0664
irintensity: 0.0682 0.3146 2.2710 1.8711 0.0111 2.8292 2.2471 0.9202 0.7713 2.0152 2.5662 0.3610 0.0055 1.1819 0.2768 0.0706 1.5403 0.0000 0.3376 4.9658 0.9983 156.2349 1.4010 3.5989 1.4541 5.3540 21.6703 2.1505 30.4608 3.3671 17.4446 14.3091 127.1849 15.2880 6.7092 10.4171 0.0968 6.1331 0.0003 2.9586 0.5203 1.3094 0.7464 0.6327 46.7176 0.1538 11.9131 9.3208 78.4352 0.2992 69.4501 20.0768 0.0160 120.0340 8.3411 10.3364 14.7409 0.8655 5.8369 5.6448 3.9029 10.0574 0.4934 0.8160 0.0392 30.6102 0.0025 32.0006 6.4622 0.0184 7.0141 0.1745 19.3933 0.0294 2.8863 0.4388 1.3246 0.0064 0.3194 21.6580 0.4984 0.0855 0.0051 0.0915 4.9062 15.6327 4.3949 0.0018 4.6060 1.4167 0.2323 30.9772 6.1464 27.7783 0.0019 0.0341 0.0337 0.2286 0.0991 0.4329 0.0324 2.1872 0.3349 3.3810 0.5225 19.9216 27.3230 208.2004 61.2931 0.0052 0.5065 0.1138 0.1898 11.5435 3.3701 0.0841 3.7070 0.0084 326.9480 52.4387 0.0038 1.0537 5.3109 0.0007 48.8488 2.7758 41.3117 0.0243 2.4152 0.1661 8.0514 0.1749 0.1096 251.8164 131.4865 97.1550 17.6450 2.0897
temp: 298.150 k
press: 1.00000 atm
elementType: 8 8 8 6 6 6 6 6 6 6 6 6 6 6 6 6 6 6 1 1 1 1 1 1 1 1 1 1 1 1 1 1 1 1 1 1 1 1 1 1 1 1 1 1 1 1 1 1
symmnumber: 1
zpe: 1121563.1 jmol-1
zpe.correction: 0.427181 hartree
zpe.thermalcorrener: 0.450775 hartree
zpe.thermalcorrenthalpy: 0.451720 hartree
zpe.thermalcorrgfe: 0.369077 hartree
zpe.sumelectzpe: -813.769877 hartree
zpe.sumelectthermal: -813.746283 hartree
zpe.sumelectthermalent: -813.745338 hartree
zpe.sumelectthermalfe: -813.827981 hartree
dipole: 0.4131 0.3712 0.0152
dipole: 0.5556
quadrupole: -114.1777 -121.4241 -111.5390
quadrupole: 31.3611 0.0862 0.0133
quadrupole: 1.5359 -5.7105 4.1746 31.3611 0.0862 0.0133
hfenergy: -814.197058 hartree
pointgroup: C01 [X(C15H30O3)]
dipole: -0.1620213 0.1466171 -0.0055888 debye
polarizability: 241.4199192|-1.7242448|153.3783307|0.1819261|0.1038782|131.3968627 unknown
InChI: InChI=1S/C15H30O3/c16-14-12-10-8-6-4-2-1-3-5-7-9-11-13-15(17)18/h16-17H,1-14H2
charge 0 multiplicity 1
48 atoms
O  -10.660394 -0.371883 -0.005091
O  9.623082 -0.715071 0.0232
O  8.644626 1.389428 0.04015
C  -0.505344 -0.472943 0.008428
C  -1.778931 0.402281 0.007434
C  0.803112 0.349321 0.011451
C  -3.08729 -0.420074 0.004404
C  2.076409 -0.526267 0.012827
C  -4.360895 0.455132 0.003405
C  3.384325 0.29658 0.015622
C  -5.668342 -0.368401 0.000591
C  4.656852 -0.579955 0.017104
C  -6.942202 0.506768 -0.000277
C  5.959042 0.2504 0.020819
C  -8.242975 -0.32782 -0.002828
C  7.215379 -0.640765 0.021419
C  -9.502662 0.541469 -0.004278
C  8.510487 0.146536 0.029271
H  -0.520478 -1.140397 0.895547
H  -0.5177 -1.138337 -0.88029
H  -1.766647 1.067688 0.89613
H  -1.763853 1.069738 -0.87969
H  0.818277 1.016569 -0.875758
H  0.815222 1.014873 0.899972
H  -3.102356 -1.087537 0.891469
H  -3.099522 -1.085479 -0.884255
H  2.06082 -1.193245 0.900327
H  2.063675 -1.191916 -0.875717
H  -4.348514 1.120533 0.892151
H  -4.345878 1.122379 -0.883917
H  3.399758 0.963444 -0.871553
H  3.39683 0.962094 0.90385
H  -5.681146 -1.033493 -0.887946
H  -5.683733 -1.035413 0.887658
H  4.642448 -1.244905 -0.872098
H  4.638906 -1.246999 0.904668
H  -6.924669 1.173281 -0.888301
H  -6.927052 1.171495 0.889126
H  5.981918 0.9180 -0.861836
H  5.979032 0.914954 0.905792
H  -8.268438 -0.98673 -0.892479
H  -8.271338 -0.987604 0.886094
H  7.224709 -1.315108 0.900604
H  7.23077 -1.308626 -0.86251
H  -9.514178 1.19299 -0.906054
H  -9.515814 1.193429 0.897165
H  -11.497545 0.157276 -0.007174
H  10.455816 -0.168791 0.029373
