program: Gaussian 09
title: 000078367
version: EM64L-G09RevD.01
frameworkgroup: C1[X(C15H30O)]
method: RPBEPBE
basis: SDD
operation: Freq
keyword: #pfreq=noraman
keyword: PBEPBE/SDD
title: #p freq=noraman PBEPBE/SDD
converged: YES YES NO NO
title: Mulliken charges:
elementType: O C C C C C C C C C C C C C C C H H H H H H H H H H H H H H H H H H H H H H H H H H H H H H
charge: -0.452759 0.032425 -0.463880 -0.462733 -0.442817 -0.434157 -0.452604 -0.030682 -0.397080 -0.385534 -0.387887 -0.381119 -0.373863 -0.352806 -0.357079 -0.696609 0.191557 0.216361 0.190832 0.195703 0.201277 0.197648 0.189392 0.216405 0.207580 0.213296 0.182975 0.177164 0.190365 0.206998 0.190137 0.196099 0.195312 0.191510 0.193309 0.190148 0.327152 0.188485 0.190727 0.188133 0.186826 0.194464 0.195192 0.214979 0.209622 0.209534
chargesum: 0.00000
title: Mulliken charges with hydrogens summed into heavy atoms:
elementType: O C C C C C C C C C C C C C C C
charge: -0.125607 0.223982 -0.056687 -0.065752 -0.055777 -0.010172 -0.056333 0.146482 0.000284 0.000702 -0.001065 0.002338 0.005350 0.022152 0.032577 -0.062474
polarizability: 2.17109388e+02 -5.75128481e-01 1.46702841e+02 1.79524322e+00 6.31813027e-01 1.33057290e+02
1716.lowfreq: -22.0848 -0.0013 -0.0010 0.0010 3.5385 5.6325 22.4689 31.7584 45.2071
frequency: 22.0691 30.7047 43.7354 48.3845 70.0730 76.6000 89.1338 113.1995 125.7105 142.5546 148.9497 156.1192 179.5681 219.3091 233.7823 247.5478 263.4910 298.5797 314.5730 328.4178 370.3627 415.1781 417.8421 457.3594 466.0255 487.6350 495.3109 594.8663 719.0052 722.0483 732.3508 757.0083 774.9895 788.8123 805.8539 850.3545 884.7523 888.1900 900.2679 932.5099 941.8548 956.0420 984.4834 989.7067 1005.3281 1011.5901 1032.6674 1037.5193 1046.5152 1054.1186 1057.6817 1069.9585 1080.0157 1081.5226 1093.6421 1100.0994 1111.1952 1127.7560 1161.0653 1183.0692 1185.1055 1212.3702 1213.2616 1232.4254 1241.4382 1245.0197 1250.3322 1262.6338 1274.3930 1276.6978 1279.7310 1285.2965 1291.4062 1293.0314 1296.8283 1303.7080 1314.1834 1318.5109 1319.4074 1337.2379 1344.1582 1346.6031 1352.8649 1354.7517 1357.3299 1362.6353 1390.1441 1397.3224 1455.7077 1459.1185 1461.0984 1462.6629 1463.6125 1464.8018 1467.2036 1470.0616 1473.9161 1476.8267 1477.5583 1480.2401 1485.2976 1489.4100 2917.3535 2935.0607 2944.7414 2948.1659 2949.3972 2950.7933 2952.8901 2954.9808 2957.4429 2960.9408 2962.8309 2967.6590 2968.1603 2971.6869 2981.5653 2984.8627 2989.3185 2990.0619 2997.3522 3008.5109 3019.0747 3021.9744 3031.2438 3033.8718 3037.1544 3041.7024 3056.6763 3068.2320 3070.2439 3550.7906
redmass: 3.7763 3.2522 1.9624 3.3924 1.6622 3.9331 2.8772 1.8976 2.5840 2.5363 2.0080 3.5485 3.2010 1.7792 1.1174 2.3216 3.0768 1.3142 3.0108 2.9463 2.6142 1.8808 3.4339 2.3656 3.0228 2.9618 3.3094 2.5327 1.0632 1.0783 1.1255 1.3296 1.9663 1.4773 1.3127 1.6246 1.4099 1.8908 1.4199 1.9426 1.5030 1.7729 5.2463 3.5609 1.2145 4.1168 2.8375 2.0022 1.3187 1.8265 1.5664 2.4006 2.0679 2.2961 2.1724 1.9683 2.0764 2.3350 2.1531 1.3152 1.7878 1.4383 1.3989 1.3644 1.2635 1.2950 1.2971 1.3032 1.2745 1.1236 1.1153 1.0940 1.1253 1.2053 1.2178 1.2166 1.2272 1.3376 1.3398 1.4178 1.5489 1.5065 1.6993 1.6262 1.5887 1.5189 1.2176 1.6736 1.0800 1.0748 1.0752 1.0872 1.0698 1.0850 1.0819 1.0830 1.0840 1.0981 1.0428 1.0857 1.0904 1.0924 1.0833 1.0798 1.0594 1.0585 1.0588 1.0591 1.0596 1.0627 1.0602 1.0632 1.0592 1.0629 1.0588 1.0366 1.0957 1.0966 1.0702 1.0909 1.1013 1.1033 1.0999 1.1029 1.1026 1.1027 1.0961 1.1043 1.1021 1.1006 1.0994 1.0659
irintensity: 0.0123 0.1859 0.2145 0.0521 0.0031 0.5414 0.0492 0.0395 0.6684 0.2252 0.0052 0.1811 0.1199 1.3291 0.0059 2.0486 2.8485 98.2393 27.1091 27.6775 1.3245 0.2815 0.0574 3.2300 1.3911 5.0602 0.9736 6.1235 15.9324 1.6354 3.2177 0.8580 0.9116 0.5920 0.5579 3.1680 0.5324 5.7918 12.4994 8.5182 3.9394 1.8031 31.4313 15.0968 1.8692 35.2433 21.2070 6.4129 6.3856 0.5798 0.9305 0.4751 0.0195 0.4682 10.0274 3.0105 25.8234 6.9256 0.5778 8.6058 0.4216 8.0551 8.9739 4.6565 0.7802 4.2912 2.0857 6.3697 0.3033 0.5754 0.9036 0.2808 0.1053 0.0698 0.5381 0.2516 0.3062 4.6048 0.7533 0.8893 5.1666 1.4418 0.1520 0.4113 0.0277 13.6655 11.2478 1.7979 0.4501 0.1029 0.2961 7.7123 0.1149 3.6896 2.0632 11.0397 8.3087 1.7346 12.2827 2.0899 5.0030 28.8704 50.4057 2.4868 6.6451 0.7484 0.2151 0.2455 2.1010 8.6329 3.8026 68.4307 106.2129 27.8034 212.6115 36.6587 1.8316 2.6107 19.9745 5.7650 1.9399 0.8880 31.4332 26.6016 6.3200 14.6993 80.8439 264.8478 65.9557 96.5390 56.6586 2.3039
temp: 298.150 k
press: 1.00000 atm
elementType: 8 6 6 6 6 6 6 6 6 6 6 6 6 6 6 6 1 1 1 1 1 1 1 1 1 1 1 1 1 1 1 1 1 1 1 1 1 1 1 1 1 1 1 1 1 1
symmnumber: 1
zpe: 1105888.6 jmol-1
zpe.correction: 0.421211 hartree
zpe.thermalcorrener: 0.440958 hartree
zpe.thermalcorrenthalpy: 0.441902 hartree
zpe.thermalcorrgfe: 0.370999 hartree
zpe.sumelectzpe: -663.481718 hartree
zpe.sumelectthermal: -663.461971 hartree
zpe.sumelectthermalent: -663.461027 hartree
zpe.sumelectthermalfe: -663.531930 hartree
dipole: 0.6716 1.7375 0.5692
dipole: 1.9478
quadrupole: -110.5679 -105.9418 -102.2232
quadrupole: -14.0436 -4.3944 -1.4903
quadrupole: -4.3236 0.3025 4.0211 -14.0436 -4.3944 -1.4903
hfenergy: -663.902929 hartree
pointgroup: C01 [X(C15H30O1)]
dipole: -0.2627739 0.6611003 -0.2848776 debye
polarizability: 217.1010824|0.6639389|146.4796501|1.9565424|-1.8373538|133.2887855 unknown
InChI: InChI=1S/C15H30O/c1-2-3-4-5-6-7-8-9-14-10-12-15(16)13-11-14/h14-16H,2-13H2,1H3
charge 0 multiplicity 1
46 atoms
O  7.005425 -0.849976 0.398677
C  2.853135 0.394829 0.179623
C  3.283706 -0.982764 -0.391757
C  3.948975 1.452792 -0.115666
C  1.477756 0.864757 -0.356652
C  4.676188 -1.41968 0.12307
C  5.335431 1.0138 0.412112
C  5.738977 -0.353613 -0.177154
C  0.279235 -0.02094 0.055812
C  -1.083373 0.598019 -0.329938
C  -2.293914 -0.277552 0.064771
C  -3.653728 0.39226 -0.23734
C  -4.869986 -0.478512 0.150825
C  -6.225957 0.221489 -0.094884
C  -7.445003 -0.648809 0.28724
C  -8.793255 0.069521 0.061612
H  2.772603 0.291536 1.285311
H  2.539351 -1.757816 -0.129002
H  3.297739 -0.91873 -1.501147
H  4.003428 1.616019 -1.213324
H  3.666848 2.424601 0.334945
H  1.52201 0.931075 -1.464916
H  1.292478 1.897708 0.007763
H  4.981415 -2.379591 -0.333042
H  4.646289 -1.57453 1.219843
H  5.309981 0.922277 1.516619
H  6.100243 1.778614 0.162382
H  5.84662 -0.246234 -1.28207
H  0.306451 -0.183485 1.154157
H  0.368012 -1.023047 -0.410298
H  -1.179887 1.59212 0.155724
H  -1.106136 0.785359 -1.424088
H  -2.235181 -1.250271 -0.467016
H  -2.23691 -0.512588 1.14849
H  -3.709735 0.639999 -1.31817
H  -3.709741 1.359488 0.305164
H  7.705816 -0.160875 0.266805
H  -4.792713 -0.757561 1.222801
H  -4.838665 -1.430056 -0.420276
H  -6.303515 0.509428 -1.164441
H  -6.258392 1.168524 0.483893
H  -7.358325 -0.948561 1.351802
H  -7.421276 -1.588146 -0.302353
H  -9.648365 -0.574174 0.339113
H  -8.916588 0.356569 -0.9999
H  -8.854967 0.993627 0.667083
