program: Gaussian 09
title: 000078319
version: EM64L-G09RevD.01
frameworkgroup: C1[X(C8H8S)]
method: RPBEPBE
basis: SDD
operation: Freq
keyword: #p
keyword: freq=noraman
keyword: PBEPBE/SDD
title: #p freq=noraman PBEPBE/SDD
converged: NO YES NO NO
title: Mulliken charges:
elementType: S C C C C C C C C H H H H H H H H
charge: 0.186534 -0.481494 0.509433 -0.677346 -0.336253 -0.402476 -0.277238 -0.233190 -0.229465 0.240655 0.230441 0.258726 0.276350 0.237191 0.243561 0.226875 0.227695
chargesum: 0.00000
title: Mulliken charges with hydrogens summed into heavy atoms:
elementType: S C C C C C C C C
charge: 0.186534 -0.010398 0.509433 -0.142269 -0.336253 -0.165285 -0.033677 -0.006315 -0.001770
polarizability: 1.33595543e+02 1.62632190e+00 1.05086705e+02 -9.07301548e-01 1.06993305e+00 4.80307138e+01
1716.lowfreq: -6.6680 -0.0022 0.0017 0.0020 6.2232 7.9902 139.9886 158.8505 247.5323
frequency: 139.9877 158.8474 247.5316 325.5888 417.5892 454.4256 462.0106 507.5654 567.8920 633.0953 676.1383 715.5186 750.9764 777.5751 861.4284 865.7704 936.2499 979.3350 991.0586 992.9918 1022.7979 1038.6158 1118.0938 1123.4019 1168.4178 1171.0886 1207.2165 1262.3107 1277.3088 1310.3637 1381.8391 1431.7436 1445.3689 1457.5435 1459.4961 1585.8600 1599.3629 2976.3824 3035.3453 3051.8062 3123.1803 3124.9796 3133.9755 3150.1264 3165.4192
redmass: 2.6111 3.6319 2.8308 5.2656 2.8211 7.0201 4.9651 3.5377 5.4063 3.3920 6.5383 3.8196 1.2797 2.6930 1.7601 1.4204 1.3818 1.3221 2.5629 1.5548 3.0249 3.3061 1.6584 1.1931 1.2504 1.0744 2.1950 1.3791 1.1854 1.5888 6.8169 2.1665 1.2617 1.1411 1.9095 6.6084 6.8194 1.0635 1.0693 1.0873 1.0867 1.1078 1.0890 1.0941 1.1005
irintensity: 3.6877 0.0866 4.8366 2.8835 7.8566 1.5345 0.6184 0.2654 1.6488 4.6682 9.9876 0.7816 80.8410 12.3131 6.4591 1.7955 2.2162 0.0309 2.9763 0.5476 20.6386 12.1940 10.2618 1.8647 2.0960 0.9296 1.2898 9.9724 8.2015 3.8477 2.3260 16.7679 11.5217 1.8120 33.9297 3.4501 14.7214 29.4457 16.2382 37.7432 3.9810 16.1057 9.2908 22.6599 24.8383
temp: 298.150 k
press: 1.00000 atm
elementType: 16 6 6 6 6 6 6 6 6 1 1 1 1 1 1 1 1
symmnumber: 1
zpe: 354594.8 jmol-1
zpe.correction: 0.135058 hartree
zpe.thermalcorrener: 0.142340 hartree
zpe.thermalcorrenthalpy: 0.143285 hartree
zpe.thermalcorrgfe: 0.103109 hartree
zpe.sumelectzpe: -707.071555 hartree
zpe.sumelectthermal: -707.064273 hartree
zpe.sumelectthermalent: -707.063329 hartree
zpe.sumelectthermalfe: -707.103504 hartree
dipole: -0.0906 1.8897 0.2528
dipole: 1.9087
quadrupole: -54.4912 -55.4322 -64.1797
quadrupole: 4.7149 0.4179 -0.0572
quadrupole: 3.5432 2.6021 -6.1453 4.7149 0.4179 -0.0572
hfenergy: -707.2066132 hartree
pointgroup: C01 [X(C8H8S1)]
dipole: -0.0593152 -0.7399187 0.11361 debye
dipolederiv: -0.5526735 0.073857 0.0195158 0.1305846 -0.1467797 -0.0026993 -0.0461864 -0.0069356 -0.085056 -0.0662759 -0.0097417 0.018545 -0.0558375 0.0031534 -0.0270658 -0.0153457 0.0061265 0.1480078 -0.0895171 0.1669421 0.0341594 0.3693829 -0.1066266 0.0118184 0.0577406 0.0514723 -0.0324621 0.1535933 0.1352687 -0.0080945 0.1868409 0.1748869 -0.0861649 -0.0409395 -0.069872 0.1674665 0.7638665 -0.3321949 0.0096827 -0.4487799 -0.0019572 0.010529 0.0398462 0.001282 -0.0880348 0.0788882 -0.0480155 0.0003373 -0.0105176 0.1204588 -0.0004657 -0.0059396 -0.005873 -0.1561062 -0.2968027 0.1102416 -0.0029579 0.0560265 0.0804155 0.002756 0.0038764 0.0006944 -0.1357273 -0.0684692 -0.0427824 0.0139898 -0.0892599 -0.0705206 -0.0099048 0.0029297 -0.0132028 -0.1810596 0.0854353 0.0004484 0.0109248 0.0241744 0.0620834 0.0000234 0.0151166 -0.0006142 -0.1576018 -0.0100456 -0.0427062 -0.0360077 -0.0070702 0.0659858 -0.0339666 -0.0548608 -0.0953703 -0.1111658 0.0664404 0.016297 0.0030001 -0.0512244 -0.1108281 0.0813782 0.041296 0.0875084 0.0539603 -0.1196223 -0.0257931 -0.050529 -0.0432283 0.0570883 0.006112 -0.0745435 0.0018775 0.0665493 0.0749816 -0.0033734 0.0171485 -0.0699234 0.0034833 0.0456343 0.0968089 0.0303433 -0.1311401 0.072892 -0.0237517 -0.0005118 0.0153359 -0.1185355 0.0010557 0.0051064 0.0040067 0.1546227 0.0922422 0.0236371 -0.0057204 -0.0148843 -0.0807242 -0.0021465 0.0020055 -0.0002059 0.1614695 -0.0872162 0.0902181 -0.0134481 0.0980213 0.0324784 0.0067493 -0.014354 0.0106817 0.1651135 -0.0977171 -0.0885513 -0.0100342 -0.0896411 0.0359378 -0.0036428 -0.0125569 -0.0019191 0.1611639 unknown
polarizability: 133.5359222|-1.9734999|105.0667221|1.2847934|-2.3030331|48.110318 unknown
InChI: InChI=1S/C8H8S/c1-2-4-8-7(3-1)5-6-9-8/h1-4H,5-6H2
charge 0 multiplicity 1
17 atoms
S  -1.855901 1.474167 -0.145553
C  -1.614017 -1.286209 -0.187151
C  -0.215457 -0.698409 -0.049235
C  -2.616253 -0.21954 0.311261
C  -0.18394 0.721125 -0.058822
C  0.997586 -1.412918 0.013525
C  1.030914 1.432609 -0.015262
C  2.229113 -0.713317 0.06349
C  2.242698 0.700731 0.044365
H  -1.810014 -1.510846 -1.255346
H  -1.733438 -2.22855 0.378168
H  -3.603351 -0.285937 -0.17026
H  -2.724991 -0.240749 1.407835
H  0.98604 -2.509396 0.022216
H  1.043258 2.527285 -0.017639
H  3.171117 -1.269398 0.11915
H  3.195636 1.240152 0.085458
