program: Gaussian 09
title: 000078552
version: EM64L-G09RevD.01
frameworkgroup: C1[X(C21H28N3O)]
method: RPBEPBE
basis: SDD
operation: Freq
keyword: #p
keyword: freq=noraman
keyword: PBEPBE/SDD
title: #p freq=noraman PBEPBE/SDD
converged: YES YES NO NO
title: Mulliken charges:
elementType: O N N N C C C C C C C C C C C C C C C C C C C C C H H H H H H H H H H H H H H H H H H H H H H H H H H H H
charge: -0.259005 -0.099574 -0.292812 -0.232498 -0.369517 -0.290164 -0.297884 -0.451741 -0.574655 -0.698091 -0.702991 0.247336 0.318198 0.266159 0.113669 -0.313485 -0.347465 0.052599 -0.305051 -0.334556 -0.243902 -0.224823 -0.642298 -0.246585 -0.246932 0.295647 0.278433 0.253879 0.262784 0.255882 0.268342 0.262845 0.209937 0.280683 0.255140 0.265256 0.268422 0.246856 0.249433 0.268738 0.256589 0.245778 0.234212 0.225058 0.258371 0.284854 0.244137 0.241918 0.249597 0.235361 0.278767 0.247516 0.251637
chargesum: 1.00000
title: Mulliken charges with hydrogens summed into heavy atoms:
elementType: O N N N C C C C C C C C C C C C C C C C C C C C C
charge: -0.259005 -0.099574 -0.292812 -0.232498 0.204563 0.226498 0.226340 0.021041 0.226424 0.066621 0.068115 0.247336 0.318198 0.266159 0.113669 -0.079274 -0.122407 0.052599 -0.046681 -0.049703 0.000235 0.017094 0.121427 0.000931 0.004705
polarizability: 2.43991156e+02 -2.28588501e+01 2.78358244e+02 2.56480629e+01 1.20153290e+01 2.19991026e+02
1716.lowfreq: -9.1561 -3.7257 -0.0003 0.0005 0.0007 3.5930 15.4905 20.5499 31.6488
frequency: 14.5636 19.7552 31.5514 52.6020 61.7745 77.3252 93.0477 108.8028 113.9737 128.6469 132.5097 142.6656 176.2984 188.8269 210.7639 223.2861 236.3224 256.6935 269.3040 285.9559 308.5448 315.7885 326.0496 337.1758 354.5504 366.1457 371.6705 389.3362 404.7329 433.0074 441.3142 455.4762 472.6267 490.0833 514.8672 531.9288 542.9910 574.2192 591.2770 606.8727 638.5810 660.3412 687.8013 699.0540 730.9030 753.3240 763.2175 774.1458 776.2661 778.8496 789.8718 803.0753 837.6957 851.5174 859.5353 871.6710 884.1790 887.3912 941.6585 949.3544 960.2004 986.6360 991.4168 997.2908 1018.0283 1022.9964 1040.6822 1044.2809 1047.7193 1060.6486 1064.7494 1072.8737 1079.9330 1110.8970 1119.7508 1125.3436 1131.8204 1140.6968 1160.5474 1173.8983 1174.0251 1179.8452 1181.5499 1205.4138 1229.5020 1249.2126 1259.4368 1265.1765 1284.6212 1288.3613 1299.6400 1319.2301 1329.4524 1340.9575 1349.4303 1362.3183 1370.1283 1376.8098 1380.3947 1386.3715 1412.9818 1415.9436 1424.0499 1436.0649 1437.0699 1441.3947 1455.8636 1458.7860 1463.0063 1473.0425 1474.9175 1475.9218 1479.4226 1484.0484 1488.2712 1490.5287 1493.0957 1495.1031 1496.5563 1497.9494 1548.4289 1586.8707 1593.8948 1602.8366 1604.7656 2927.6403 2996.3282 3007.5049 3008.5452 3025.9889 3026.8949 3031.8069 3046.3442 3064.4024 3087.0281 3090.9512 3094.9022 3096.8211 3097.9937 3116.6845 3120.1762 3122.8257 3123.4293 3128.1898 3134.5130 3141.0533 3147.9509 3149.5100 3156.0651 3161.0989 3163.1038 3178.3531 3178.5095
redmass: 4.2619 3.3625 4.7150 5.0776 3.9502 2.8647 2.4914 3.7033 3.3291 1.7730 2.7060 1.1766 2.6188 2.0104 1.6862 3.4086 2.2118 1.4874 1.5535 2.1067 2.4003 3.0813 3.5409 5.5778 3.9395 3.2020 2.9240 3.8811 4.2812 3.7745 3.5667 3.0251 3.3054 3.8868 2.8580 3.9680 4.5856 4.5187 4.0567 5.2096 6.1796 5.8045 4.9663 3.2700 4.2453 2.8741 1.6584 1.4491 1.3779 3.0515 1.5637 1.2042 2.2072 2.4132 1.4106 1.4909 3.5172 2.7146 1.3735 2.5517 1.3954 1.4417 3.9566 1.3580 2.1848 2.0532 3.1443 2.2342 2.9037 2.2762 2.8889 1.9743 1.7398 1.3633 1.9280 1.7463 1.6203 1.6365 1.7594 1.9907 1.7829 1.0642 1.1943 1.7890 1.7776 2.9827 1.5441 1.9805 1.2319 2.3485 1.3218 1.3960 1.1874 1.5119 2.6946 1.2916 1.3357 4.6990 9.8899 1.4348 1.1915 1.1977 1.2214 1.2701 1.8765 2.4333 1.0763 1.1155 1.0591 1.1741 1.0924 1.8783 1.0573 1.0679 1.0653 1.0636 1.3754 1.1046 1.0734 1.7712 6.7670 7.3817 7.6106 6.4298 6.2125 1.0693 1.0378 1.0378 1.0376 1.0621 1.0563 1.0375 1.0593 1.0907 1.1047 1.0965 1.1011 1.0975 1.0997 1.1031 1.1056 1.1027 1.0886 1.0885 1.1024 1.1041 1.0908 1.0881 1.1043 1.0926 1.0936 1.1003 1.0999
irintensity: 0.6992 0.3555 2.6135 1.1259 2.0964 0.5762 0.9855 4.6106 1.2027 0.0710 0.0076 1.1078 1.5620 4.6796 0.9316 1.0964 1.1539 0.3229 0.4951 1.2016 0.1464 0.6012 4.0769 4.2707 1.4720 0.6507 0.1357 1.4050 10.4587 1.0322 0.7372 9.3747 12.6623 4.2776 1.4076 2.6684 0.3628 5.9195 15.2368 3.4581 8.0871 0.3691 28.3826 3.3979 5.7051 14.8240 45.8657 97.8348 4.5849 8.1916 31.0048 16.3295 1.2763 5.7286 1.0774 1.2797 10.7396 7.6246 1.2594 15.9743 3.4269 1.2679 10.6149 0.8606 30.9869 24.6845 6.5715 15.3845 1.6789 8.2722 3.0632 4.1126 3.0722 21.1417 3.2391 30.1509 24.7313 14.7425 7.6234 2.5227 7.5040 0.2779 2.4718 1.8105 32.8394 59.2425 8.2256 20.6745 4.7571 51.8757 15.1881 2.3850 1.8680 34.9727 181.7954 0.2725 2.0611 1.2390 7.3385 8.2411 34.3992 17.4083 45.2976 18.6260 56.2982 28.2146 3.3330 24.9063 3.8655 2.7782 57.5113 61.7194 3.5812 4.0333 8.8023 34.6293 48.4030 9.6659 45.0609 89.4487 219.1124 84.7347 8.9996 17.4960 28.6496 70.4274 29.3419 2.7284 3.1357 10.0303 4.5408 9.7773 3.8923 8.5520 0.8981 16.3775 3.1366 9.1754 2.4583 23.1447 16.1662 12.1121 10.7619 12.1777 3.2170 9.0173 9.6689 3.0179 3.7679 4.8015 11.6701 14.7632 5.2117
temp: 298.150 k
press: 1.00000 atm
elementType: 8 7 7 7 6 6 6 6 6 6 6 6 6 6 6 6 6 6 6 6 6 6 6 6 6 1 1 1 1 1 1 1 1 1 1 1 1 1 1 1 1 1 1 1 1 1 1 1 1 1 1 1 1
symmnumber: 1
zpe: 1188068.1 jmol-1
zpe.correction: 0.452511 hartree
zpe.thermalcorrener: 0.477003 hartree
zpe.thermalcorrenthalpy: 0.477948 hartree
zpe.thermalcorrgfe: 0.397413 hartree
zpe.sumelectzpe: -1054.414275 hartree
zpe.sumelectthermal: -1054.389782 hartree
zpe.sumelectthermalent: -1054.388838 hartree
zpe.sumelectthermalfe: -1054.469373 hartree
dipole: -13.6271 -4.7301 -1.7748
dipole: 14.5334
quadrupole: -70.9825 -124.7430 -137.0350
quadrupole: -1.0648 -0.3807 -7.7747
quadrupole: 39.9377 -13.8228 -26.1148 -1.0648 -0.3807 -7.7747
hfenergy: -1054.8667858 hartree
pointgroup: C01 [X(C21H28N3O1)]
dipole: -5.2720271 -2.1935766 -0.2970632 debye
polarizability: 248.3869674|-21.686492|277.9455996|26.139893|8.4867947|216.0078587 unknown
InChI: InChI=1S/C21H28N3O/c1-5-24(4,6-2)16-15-23-18-12-8-7-11-17(18)21(25)22(3)19-13-9-10-14-20(19)23/h7-14H,5-6,15-16H2,1-4H3
charge 1 multiplicity 1
53 atoms
O  1.848253 2.305982 2.099936
N  -3.583857 -0.705974 0.210554
N  0.15943 -0.341451 -0.556895
N  2.285902 0.160145 1.334018
C  -2.08325 -0.355581 0.331477
C  -3.806744 -2.243613 0.162698
C  -4.34429 -0.123429 1.437793
C  -1.144109 -0.995101 -0.722359
C  -4.161571 -0.115082 -1.073854
C  -3.31869 -3.021282 1.389608
C  -4.351273 1.406139 1.540985
C  1.361476 -1.141446 -0.58609
C  0.306376 1.04337 -0.928875
C  2.420748 -0.845737 0.319511
C  1.158688 1.875125 -0.1524
C  1.502175 -2.200337 -1.515542
C  -0.373485 1.584957 -2.050578
C  1.773111 1.456897 1.155724
C  3.599377 -1.636079 0.268484
C  1.326433 3.233323 -0.526646
C  2.667529 -2.994465 -1.538388
C  -0.194768 2.937889 -2.410222
C  2.925405 -0.10171 2.651615
C  3.721882 -2.702891 -0.644313
C  0.666789 3.764923 -1.652441
H  -2.015822 0.74096 0.251738
H  -1.754261 -0.648973 1.34119
H  -4.892509 -2.381895 0.014052
H  -3.294983 -2.594158 -0.749179
H  -5.374147 -0.516868 1.362972
H  -3.867561 -0.564106 2.327895
H  -1.005242 -2.069915 -0.519738
H  -1.562237 -0.903428 -1.749071
H  -3.868282 0.940618 -1.157838
H  -3.77398 -0.67388 -1.937871
H  -5.259026 -0.200135 -1.04448
H  -3.470959 -4.095892 1.18588
H  -2.242767 -2.882185 1.587875
H  -3.885316 -2.787727 2.305186
H  -4.914814 1.672649 2.452671
H  -3.343388 1.838192 1.654923
H  -4.861871 1.89648 0.696193
H  0.698981 -2.394951 -2.235954
H  -1.0082 0.943764 -2.672935
H  4.425966 -1.413479 0.94955
H  1.957099 3.864991 0.106164
H  2.759664 -3.814671 -2.257036
H  -0.711823 3.339857 -3.288295
H  3.982963 0.220008 2.662822
H  2.862954 -1.177438 2.878464
H  2.395951 0.484964 3.416541
H  4.640974 -3.296818 -0.662037
H  0.813997 4.812465 -1.931784
