program: Gaussian 09
title: 000078316
version: EM64L-G09RevD.01
frameworkgroup: C1[X(C8H10N2O)]
method: RPBEPBE
basis: SDD
operation: Freq
keyword: #p
keyword: freq=noraman
keyword: PBEPBE/SDD
title: #p freq=noraman PBEPBE/SDD
converged: YES YES NO NO
title: Mulliken charges:
elementType: O N N C C C C C C C C H H H H H H H H H H
charge: -0.298232 -0.239780 -0.663688 0.427754 -0.325435 -0.366877 -0.693641 -0.222917 -0.229418 0.254702 -0.252788 0.298475 0.236313 0.261472 0.226683 0.245542 0.224844 0.222150 0.227139 0.324924 0.342780
chargesum: 0.00000
title: Mulliken charges with hydrogens summed into heavy atoms:
elementType: O N N C C C C C C C C
charge: -0.298232 -0.239780 0.004015 0.427754 -0.026960 -0.130565 0.040056 0.001926 -0.007268 0.254702 -0.025650
polarizability: 1.47870748e+02 3.13075221e+00 1.07442531e+02 1.32587916e+00 -6.39505147e+00 5.04050156e+01
1716.lowfreq: -13.4772 -11.0044 -0.0005 0.0001 0.0007 4.8707 37.5345 81.3962 132.6123
frequency: 37.4705 81.3740 132.6084 199.3131 213.5984 279.0449 349.9544 365.3908 379.4427 409.9286 464.8799 510.1704 537.3139 558.0060 588.8031 615.0329 695.7823 704.5344 717.6651 765.5751 833.7337 903.6389 915.8990 965.5777 984.4471 988.9251 1030.0128 1045.6595 1084.9250 1102.7230 1116.4853 1168.3310 1175.3169 1196.8262 1278.4168 1324.2991 1368.1568 1380.4469 1442.1622 1444.4655 1486.2982 1491.6014 1493.7783 1579.3212 1587.5852 1613.6533 1641.2783 2951.9435 3054.9892 3101.7288 3124.6151 3134.8034 3150.0723 3164.4053 3204.0486 3543.5590 3694.0822
redmass: 4.3988 4.0375 3.7924 3.0684 1.3307 4.5558 3.4872 3.9263 2.0800 2.9320 1.4481 3.1024 1.1801 3.2026 5.1799 6.3175 1.9551 5.1027 6.7583 1.8054 1.2454 1.5918 2.6689 1.3589 4.2919 1.4315 2.2365 1.7224 1.7075 1.7891 1.5083 1.8125 1.2768 1.1393 3.7038 1.3793 3.2784 8.0067 2.2826 1.2799 1.9895 1.0689 1.1591 2.0704 4.5371 4.7844 2.4654 1.0453 1.0898 1.0995 1.0846 1.0893 1.0937 1.1002 1.0944 1.0449 1.1040
irintensity: 9.4891 3.1108 2.4028 4.2717 2.2798 6.4095 10.5297 6.8701 51.6531 2.6193 68.9110 2.3818 170.2537 11.1417 16.5047 1.8634 45.1502 5.6772 13.5164 86.0584 1.0153 7.1961 17.4186 0.9875 1.3461 0.8466 21.1399 36.0476 6.2043 21.0600 13.7245 32.3975 22.4225 2.4367 3.8782 25.6830 461.0617 1.0538 15.8608 70.9041 73.0570 19.6102 129.6167 157.6848 32.7063 17.3539 262.1988 63.2753 26.7968 13.1462 1.7588 13.1626 39.5851 18.8841 5.1683 43.7172 35.1820
temp: 298.150 k
press: 1.00000 atm
elementType: 8 7 7 6 6 6 6 6 6 6 6 1 1 1 1 1 1 1 1 1 1
symmnumber: 1
zpe: 444855.9 jmol-1
zpe.correction: 0.169437 hartree
zpe.thermalcorrener: 0.179613 hartree
zpe.thermalcorrenthalpy: 0.180558 hartree
zpe.thermalcorrgfe: 0.133480 hartree
zpe.sumelectzpe: -494.781901 hartree
zpe.sumelectthermal: -494.771724 hartree
zpe.sumelectthermalent: -494.770780 hartree
zpe.sumelectthermalfe: -494.817857 hartree
dipole: 1.8198 4.2715 0.1189
dipole: 4.6445
quadrupole: -49.2375 -63.0703 -68.7830
quadrupole: 7.8923 -0.9645 -2.2242
quadrupole: 11.1261 -2.7067 -8.4194 7.8923 -0.9645 -2.2242
hfenergy: -494.9513373 hartree
pointgroup: C01 [X(C8H10N2O1)]
dipole: 0.682026 -1.6899455 -0.1338124 debye
dipolederiv: -0.6864644 0.023351 -0.0542284 -0.0951653 -1.0909606 -0.1700701 -0.1621475 -0.146984 -0.4413954 -1.6238697 -0.1497709 -0.2213153 -0.3596656 -0.6962313 -0.1185576 -0.2922588 -0.1939494 -0.339943 -1.4136607 0.2099451 -0.0570581 0.2886702 -0.3135719 0.0409929 -0.0175562 0.0244562 -0.7285397 1.3527358 -0.1259296 0.0422744 -0.3126175 0.0020245 -0.1086016 0.0682837 -0.0385012 0.0736689 -0.2714532 0.062803 -0.0142746 0.2908399 -0.072198 0.000614 0.0416104 0.0113955 -0.1511049 -0.2967047 0.0238949 -0.0132011 -0.1736459 0.0145388 -0.0328852 -0.0274725 -0.0461204 -0.1948809 0.0267676 -0.1048888 -0.0594623 -0.2048234 0.4547693 -0.0169479 0.0106319 -0.0456363 0.2258094 0.1121488 -0.0281423 0.0050108 -0.0488792 0.1541217 -0.0548324 0.0155232 -0.0332137 -0.1416192 0.0837626 0.0050089 -0.0017795 0.0846122 0.0991228 -0.0421326 -0.0352563 -0.039905 -0.152432 2.1383007 0.0523608 0.4408459 0.4658754 1.4222745 0.3101269 0.5385834 0.2445155 0.4834254 -0.0333927 -0.0238101 -0.0016671 -0.0585567 -0.1377841 -0.0051314 0.0146877 0.001694 -0.1843073 0.146924 -0.0608808 0.0272835 -0.0401527 0.0674546 0.0228129 0.0356522 0.0006489 0.1712138 0.0682348 0.082415 -0.0164962 0.0826042 -0.0789812 0.0421773 -0.014063 0.0495106 0.1516452 0.0557285 -0.1064067 -0.1309142 -0.0371137 0.0332059 -0.0360881 -0.0950265 -0.0373171 0.0298559 0.0785793 0.0295379 0.0062502 0.0604518 -0.1191572 0.0609799 -0.0349655 0.1475573 -0.0741907 -0.1116781 0.0778945 0.1233157 0.0089522 0.0691401 0.0318924 0.0758989 0.0253286 0.0787069 0.0500535 0.0625946 -0.0108247 0.0820354 -0.099041 0.0412437 -0.0229175 0.034425 0.1465624 -0.0175434 -0.0989079 0.0151362 -0.1182735 -0.0422681 0.0323469 0.0239383 0.0266299 0.1518494 -0.1389269 0.0399352 -0.0070261 0.0387527 0.08399 0.0130874 -0.0066197 0.0079181 0.167693 0.2313856 0.012316 -0.0261581 0.0208755 0.0870917 0.0115953 -0.0688743 0.0292034 0.3645034 0.2490726 0.0166803 -0.0457108 0.025224 0.1624597 -0.0226228 -0.0476517 -0.0216559 0.3634793 unknown
polarizability: 147.1904015|-4.0128156|108.3262034|6.9932699|-1.6471736|50.2016898 unknown
InChI: InChI=1S/C8H10N2O/c1-10(8(9)11)7-5-3-2-4-6-7/h2-6H,9H2,1H3
charge 0 multiplicity 1
21 atoms
O  1.886494 1.70234 0.707619
N  1.133943 -0.461962 0.075683
N  3.383685 -0.061125 0.730909
C  -0.27484 -0.157374 0.068077
C  -0.766276 1.163754 -0.127213
C  -1.207936 -1.218461 0.240168
C  1.552333 -1.818986 -0.332372
C  -2.157184 1.39903 -0.154298
C  -2.59634 -0.968319 0.201244
C  2.106276 0.468041 0.51698
C  -3.083266 0.342348 0.002167
H  -0.058977 1.986399 -0.23493
H  -0.859923 -2.238754 0.431121
H  0.818215 -2.226536 -1.044771
H  1.634971 -2.525188 0.519942
H  2.522109 -1.767217 -0.855915
H  -2.516721 2.423036 -0.307157
H  -3.295037 -1.801429 0.339084
H  -4.160759 0.536823 -0.02622
H  3.59121 -1.052116 0.822251
H  4.085122 0.615996 1.02273
